program: Orca
programVersion: 5.0.2
elementType: Cl F F F F F O O N N N N C C C C C C C C C C C C C C C C C C C H H H H H H H H H H H H H H
charge: 0
multiplicity: 1
keywords: wb97x-d3
keywords: def2-TZVPP
keywords: def2/J RIJCOSX
keywords: DEFGRID2
keywords: scfconv7
keywords: smallprint printgap noloewdin
keywords: NOSOSCF
formula: C19H14ClF5N4O2
InChI: InChI=1/C19H14ClF5N4O2/c20-14-7-6-13(8-12(14)9-31-10-18(21,22)19(23,24)25)29-17(11-4-2-1-3-5-11)27-16(28-29)15(26)30/h1-8H,9-10,26H2
45 atoms
Cl 1.470585 -4.006601 0.440188
F  3.321221 1.652022 0.190568
F  4.767337 0.430161 1.258196
F  5.630328 1.171373 -1.166018
F  3.895176 0.334491 -2.12469
F  5.275117 -0.953174 -1.080506
O  2.089924 -0.29054 1.583508
O  -7.042186 -0.687772 -0.255825
N  -3.004176 -0.188889 0.006312
N  -4.248957 -0.657521 -0.053871
N  -4.256349 1.574763 -0.101677
N  -7.033312 1.580164 -0.255813
C  -1.921327 -1.091213 0.129616
C  0.176907 -1.714936 1.150232
C  -0.899423 -0.840712 1.028065
C  1.28931 -1.337565 2.095776
C  -3.012315 1.164827 -0.037416
C  -1.911891 -2.238987 -0.649459
C  0.17446 -2.858677 0.356155
C  2.825525 -0.648416 0.447976
C  -1.837044 2.037424 -0.038828
C  -0.863334 -3.129043 -0.525532
C  3.879408 0.420675 0.237307
C  -4.968821 0.432149 -0.114975
C  -1.848564 3.176736 0.762575
C  -0.732008 1.77097 -0.845982
C  4.687809 0.241323 -1.059928
C  -0.754491 4.027767 0.774218
C  0.356753 2.627387 -0.83291
C  0.351215 3.752381 -0.018424
C  -6.451494 0.379491 -0.21385
H  -0.930871 0.036639 1.662086
H  0.860796 -0.954356 3.022256
H  1.904677 -2.203749 2.356567
H  -2.712867 -2.441856 -1.347224
H  3.331889 -1.612484 0.575097
H  2.193545 -0.720824 -0.445654
H  -0.849485 -4.027528 -1.126861
H  -2.708032 3.390592 1.38495
H  -0.722395 0.907374 -1.498654
H  -0.766076 4.905866 1.406608
H  1.206001 2.41887 -1.469241
H  1.205167 4.417267 -0.006559
H  -6.491807 2.429038 -0.231529
H  -8.03466 1.655812 -0.339726
elementType: Cl F O N C H
totalener: -2061.57499061 hartree
nucrepener: 3341.59932033 hartree
electener: -5403.17431095 hartree
oneelecener: -9480.03662610 hartree
twoeener: 4076.86231515 hartree
cpcmener: -0.04402388 hartree
kineticenergy: 2054.87299545 hartree
xcener: -164.585099863100 hartree
chargesum: 0.0000000
charge: -0.076302 -0.181552 -0.184830 -0.156229 -0.161457 -0.160444 -0.340664 -0.488939 0.169817 -0.305677 -0.415358 -0.224064 0.067017 -0.013431 -0.190153 0.037521 0.472058 -0.178206 0.072186 -0.057599 -0.160858 -0.097146 0.345350 0.267591 -0.168874 -0.166517 0.450345 -0.196057 -0.195002 -0.091253 0.239143 0.157255 0.115787 0.114714 0.151039 0.126037 0.126076 0.142704 0.142333 0.156882 0.155957 0.149202 0.159454 0.197765 0.194378
qa: -0.0763 -0.1816 -0.1848 -0.1562 -0.1615 -0.1604 -0.3407 -0.4889 0.1698 -0.3057 -0.4154 -0.2241 0.0670 -0.0134 -0.1902 0.0375 0.4721 -0.1782 0.0722 -0.0576 -0.1609 -0.0971 0.3453 0.2676 -0.1689 -0.1665 0.4503 -0.1961 -0.1950 -0.0913 0.2391 0.1573 0.1158 0.1147 0.1510 0.1260 0.1261 0.1427 0.1423 0.1569 0.1560 0.1492 0.1595 0.1978 0.1944
va: 1.2505 1.1148 1.1231 1.1644 1.1529 1.1563 1.9437 2.0352 3.3818 2.9682 3.0457 3.2160 3.7247 3.5567 3.9710 3.8911 3.6246 4.0442 3.8432 3.9142 3.5099 3.9871 4.3009 3.7365 3.9692 3.8747 4.4355 3.9707 3.9069 3.8673 4.4071 0.9951 0.9948 1.0058 1.0155 1.0159 0.9926 1.0062 1.0203 1.0011 0.9946 1.0083 0.9894 1.0150 1.0031
dispcorr: -0.025072929 hartree
energy: -2061.600063542931
dipole: -35.06237 36.24569 1.18332 10.51738 -9.49316 1.02422 5.65446 -5.62633 0.02813
magnitude: 1.56526 au
magnitude: 3.97859 debye
