program: Orca
programVersion: 5.0.2
elementType: Cl F F F F F O O N N N N C C C C C C C C C C C C C C C C C C C H H H H H H H H H H H H H H
charge: 0
multiplicity: 1
keywords: wb97x-d3
keywords: def2-TZVPP
keywords: def2/J RIJCOSX
keywords: DEFGRID2
keywords: scfconv7
keywords: smallprint printgap noloewdin
keywords: NOSOSCF
formula: C19H14ClF5N4O2
InChI: InChI=1/C19H14ClF5N4O2/c20-14-7-6-13(8-12(14)9-31-10-18(21,22)19(23,24)25)29-17(11-4-2-1-3-5-11)27-16(28-29)15(26)30/h1-8H,9-10,26H2
45 atoms
Cl 1.039579 -4.851682 1.118169
F  5.144818 0.802202 -1.592884
F  3.356482 0.500919 -2.807821
F  3.347303 1.695037 0.472666
F  1.821577 1.717425 -1.057234
F  3.615399 2.873328 -1.312269
O  2.264619 -1.059003 -0.753439
O  -6.168049 0.018081 -1.789303
N  -2.550506 -0.308117 0.06288
N  -3.700781 -0.513721 -0.575365
N  -3.451235 1.653828 -0.102587
N  -5.89389 2.217303 -1.307489
C  -1.680694 -1.399961 0.304877
C  0.519424 -2.365572 0.191577
C  -0.346804 -1.310081 -0.060782
C  1.978675 -2.294879 -0.154909
C  -2.405849 1.005993 0.356909
C  -2.190123 -2.542287 0.897891
C  -0.00518 -3.509053 0.789782
C  3.634943 -0.818557 -0.87114
C  -1.289899 1.623628 1.07454
C  -1.342052 -3.609359 1.135381
C  3.820756 0.528512 -1.537322
C  -4.208482 0.68901 -0.656422
C  -0.856269 2.883574 0.664304
C  -0.681596 1.0096 2.168895
C  3.132869 1.724671 -0.841982
C  0.185947 3.51219 1.326523
C  0.360898 1.643232 2.826686
C  0.801113 2.890648 2.40439
C  -5.521573 0.935451 -1.308806
H  0.015839 -0.413944 -0.543256
H  2.572935 -2.426834 0.7597
H  2.24777 -3.11977 -0.828362
H  -3.232768 -2.603632 1.178743
H  4.137759 -0.817411 0.103547
H  4.137003 -1.570665 -1.495467
H  -1.722631 -4.509372 1.598725
H  -1.328937 3.36681 -0.181133
H  -1.027755 0.048853 2.527113
H  0.520794 4.486707 0.995654
H  0.82593 1.162192 3.677241
H  1.617393 3.380351 2.919554
H  -5.313975 2.93217 -0.898203
H  -6.766698 2.495257 -1.727981
elementType: Cl F O N C H
totalener: -2061.57774290 hartree
nucrepener: 3388.58232788 hartree
electener: -5450.16007077 hartree
oneelecener: -9574.92921158 hartree
twoeener: 4124.76914080 hartree
cpcmener: -0.04387304 hartree
kineticenergy: 2054.85540235 hartree
xcener: -164.583430040862 hartree
chargesum: -0.0000000
charge: -0.078215 -0.185215 -0.185908 -0.169600 -0.157189 -0.162169 -0.337599 -0.489904 0.172581 -0.304857 -0.418852 -0.224752 0.033033 0.113764 -0.175563 0.022208 0.475459 -0.185374 0.004219 -0.032442 -0.124311 -0.114152 0.341555 0.266729 -0.188023 -0.196478 0.471905 -0.189142 -0.152813 -0.129203 0.239626 0.161309 0.103045 0.108924 0.149383 0.119019 0.120878 0.141746 0.138150 0.158286 0.153902 0.155374 0.158306 0.197706 0.194653
qa: -0.0782 -0.1852 -0.1859 -0.1696 -0.1572 -0.1622 -0.3376 -0.4899 0.1726 -0.3049 -0.4189 -0.2248 0.0330 0.1138 -0.1756 0.0222 0.4755 -0.1854 0.0042 -0.0324 -0.1243 -0.1142 0.3416 0.2667 -0.1880 -0.1965 0.4719 -0.1891 -0.1528 -0.1292 0.2396 0.1613 0.1030 0.1089 0.1494 0.1190 0.1209 0.1417 0.1382 0.1583 0.1539 0.1554 0.1583 0.1977 0.1947
va: 1.2539 1.1225 1.1255 1.1472 1.1548 1.1544 1.9870 2.0340 3.3861 2.9686 3.0474 3.2154 3.7598 3.5403 3.9496 3.9532 3.6159 4.0533 3.9816 3.9259 3.4715 3.9997 4.2743 3.7396 3.9549 3.9006 4.3829 3.9263 3.9048 3.8411 4.4067 1.0141 0.9871 0.9882 1.0133 1.0062 1.0020 1.0059 1.0244 0.9992 0.9955 0.9942 0.9892 1.0149 1.0029
dispcorr: -0.024744675 hartree
energy: -2061.602487571499
dipole: -20.78893 23.35971 2.57078 1.62123 -1.16527 0.45596 12.41705 -10.39213 2.02492
magnitude: 3.30410 au
magnitude: 8.39837 debye
