program: Orca
programVersion: 5.0.2
elementType: Cl F F F F F O O N N N N C C C C C C C C C C C C C C C C C C C H H H H H H H H H H H H H H
charge: 0
multiplicity: 1
keywords: wb97x-d3
keywords: def2-TZVPP
keywords: def2/J RIJCOSX
keywords: DEFGRID2
keywords: scfconv7
keywords: smallprint printgap noloewdin
keywords: NOSOSCF
formula: C19H14ClF5N4O2
InChI: InChI=1/C19H14ClF5N4O2/c20-14-7-6-13(8-12(14)9-31-10-18(21,22)19(23,24)25)29-17(11-4-2-1-3-5-11)27-16(28-29)15(26)30/h1-8H,9-10,26H2
45 atoms
Cl 1.090114 -4.776244 1.559398
F  2.078364 1.632928 -0.755753
F  4.147888 1.270701 -0.198918
F  4.710471 0.473624 -2.752932
F  3.835748 2.437975 -2.624224
F  2.654897 0.776903 -3.323486
O  2.56667 -0.702227 0.62785
O  -5.654955 0.13193 -2.258388
N  -2.399436 -0.241339 0.162829
N  -3.410443 -0.423382 -0.682798
N  -3.303567 1.716098 -0.051363
N  -5.49644 2.313401 -1.659966
C  -1.551967 -1.32586 0.491959
C  0.660989 -2.18758 0.897791
C  -0.181055 -1.134593 0.568819
C  2.148947 -1.97601 1.043797
C  -2.347103 1.05491 0.554097
C  -2.112636 -2.572102 0.72028
C  0.083686 -3.432919 1.129772
C  2.827127 -0.604785 -0.745339
C  -1.398842 1.61508 1.5193
C  -1.283628 -3.633331 1.035718
C  3.153664 0.850294 -1.012569
C  -3.925554 0.773527 -0.786205
C  -1.18252 0.997669 2.749963
C  -0.717522 2.787484 1.202855
C  3.597734 1.142053 -2.45807
C  -0.281654 1.544874 3.648807
C  0.187135 3.327343 2.104545
C  0.408317 2.706174 3.325785
C  -5.111661 1.035254 -1.642709
H  0.240791 -0.16034 0.367244
H  2.417944 -2.060272 2.100229
H  2.700556 -2.761263 0.513836
H  -3.182126 -2.718623 0.657045
H  3.674671 -1.237922 -1.034544
H  1.969982 -0.899932 -1.361808
H  -1.707218 -4.611534 1.218048
H  -1.72326 0.097668 3.014338
H  -0.885423 3.269068 0.247994
H  -0.12129 1.065011 4.605283
H  0.721419 4.233353 1.850192
H  1.115143 3.128631 4.028129
H  -5.010889 3.015451 -1.125551
H  -6.293988 2.59363 -2.208369
elementType: Cl F O N C H
totalener: -2061.57673322 hartree
nucrepener: 3353.38224997 hartree
electener: -5414.95898318 hartree
oneelecener: -9504.10820921 hartree
twoeener: 4089.14922603 hartree
cpcmener: -0.04433950 hartree
kineticenergy: 2054.86975332 hartree
xcener: -164.586765111963 hartree
chargesum: -0.0000000
charge: -0.079432 -0.184613 -0.184434 -0.160617 -0.155511 -0.159940 -0.355390 -0.489160 0.168679 -0.303173 -0.413510 -0.224370 0.089182 0.102217 -0.215150 0.007866 0.478162 -0.193229 -0.023203 -0.064092 -0.154518 -0.104752 0.351230 0.268441 -0.171270 -0.189298 0.450575 -0.181660 -0.196087 -0.096974 0.235563 0.166624 0.132165 0.114929 0.147843 0.146167 0.134507 0.142649 0.156217 0.142319 0.156722 0.155653 0.160284 0.197729 0.194660
qa: -0.0794 -0.1846 -0.1844 -0.1606 -0.1555 -0.1599 -0.3554 -0.4892 0.1687 -0.3032 -0.4135 -0.2244 0.0892 0.1022 -0.2152 0.0079 0.4782 -0.1932 -0.0232 -0.0641 -0.1545 -0.1048 0.3512 0.2684 -0.1713 -0.1893 0.4506 -0.1817 -0.1961 -0.0970 0.2356 0.1666 0.1322 0.1149 0.1478 0.1462 0.1345 0.1426 0.1562 0.1423 0.1567 0.1557 0.1603 0.1977 0.1947
va: 1.2517 1.1123 1.1222 1.1559 1.1648 1.1570 1.9561 2.0352 3.3880 2.9697 3.0474 3.2152 3.7295 3.5079 3.9384 3.9391 3.6069 4.0472 3.9794 3.8854 3.5003 3.9896 4.2280 3.7327 3.8867 3.9510 4.4500 3.9323 3.9537 3.8634 4.4105 0.9969 0.9869 0.9928 1.0186 1.0093 0.9946 1.0053 1.0013 1.0186 0.9942 0.9950 0.9883 1.0151 1.0030
dispcorr: -0.023987769 hartree
energy: -2061.600720984719
dipole: -23.83756 25.43788 1.60032 2.95019 -2.65566 0.29453 18.89548 -17.25275 1.64274
magnitude: 2.31222 au
magnitude: 5.87719 debye
