program: Orca
programVersion: 5.0.2
elementType: Cl F F F F F O O N N N N C C C C C C C C C C C C C C C C C C C H H H H H H H H H H H H H H
charge: 0
multiplicity: 1
keywords: wb97x-d3
keywords: def2-TZVPP
keywords: def2/J RIJCOSX
keywords: DEFGRID2
keywords: scfconv7
keywords: smallprint printgap noloewdin
keywords: NOSOSCF
formula: C19H14ClF5N4O2
InChI: InChI=1/C19H14ClF5N4O2/c20-14-7-6-13(8-12(14)9-31-10-18(21,22)19(23,24)25)29-17(11-4-2-1-3-5-11)27-16(28-29)15(26)30/h1-8H,9-10,26H2
45 atoms
Cl 1.10703 -4.94935 -1.060464
F  3.679363 0.72741 2.844579
F  4.767757 0.472602 0.969558
F  1.625423 1.945663 1.396329
F  2.86162 1.83286 -0.368983
F  3.555065 2.905522 1.358843
O  2.650309 -0.919083 -0.104685
O  -5.766548 0.151074 2.122414
N  -2.354631 -0.291844 -0.051703
N  -3.427353 -0.447077 0.7213
N  -3.264975 1.672377 0.03893
N  -5.590066 2.307937 1.445203
C  -1.508625 -1.401442 -0.294185
C  0.70299 -2.335773 -0.48638
C  -0.130879 -1.250706 -0.252305
C  2.2052 -2.187875 -0.501333
C  -2.266446 0.992547 -0.473689
C  -2.085621 -2.633429 -0.554671
C  0.108435 -3.566921 -0.748702
C  2.768943 -0.741497 1.279072
C  -1.248883 1.540604 -1.372552
C  -1.266388 -3.725012 -0.778736
C  3.53079 0.54743 1.512343
C  -3.943531 0.753757 0.751697
C  -0.670287 2.769717 -1.064101
C  -0.875898 0.873816 -2.538335
C  2.878808 1.83063 0.957567
C  0.287309 3.315867 -1.904347
C  0.079838 1.426279 -3.375475
C  0.666866 2.643952 -3.057777
C  -5.189719 1.036681 1.511543
H  0.29677 -0.28219 -0.034118
H  2.668592 -2.970782 0.112267
H  2.564373 -2.334488 -1.524152
H  -3.160051 -2.749808 -0.587087
H  1.801016 -0.694375 1.792001
H  3.342954 -1.554686 1.744743
H  -1.703222 -4.692265 -0.985705
H  -0.961393 3.293474 -0.162776
H  -1.337771 -0.068462 -2.803748
H  0.73954 4.266597 -1.654313
H  0.362361 0.906284 -4.281195
H  1.415557 3.07159 -3.711762
H  -5.07666 2.995169 0.917288
H  -6.429165 2.604566 1.918582
elementType: Cl F O N C H
totalener: -2061.57619391 hartree
nucrepener: 3407.88217384 hartree
electener: -5469.45836775 hartree
oneelecener: -9613.00536938 hartree
twoeener: 4143.54700163 hartree
cpcmener: -0.04412687 hartree
kineticenergy: 2054.86328137 hartree
xcener: -164.585344629622 hartree
chargesum: 0.0000000
charge: -0.079622 -0.185898 -0.186394 -0.170339 -0.159813 -0.160573 -0.355857 -0.489135 0.171888 -0.305880 -0.416141 -0.223959 0.072468 0.105370 -0.205506 -0.006321 0.485526 -0.189126 -0.018660 -0.051732 -0.144953 -0.106273 0.360828 0.268003 -0.193505 -0.181524 0.468441 -0.209312 -0.171675 -0.097832 0.237063 0.176671 0.114648 0.130691 0.147613 0.129088 0.136100 0.142859 0.140779 0.157982 0.155138 0.156895 0.159552 0.197418 0.195009
qa: -0.0796 -0.1859 -0.1864 -0.1703 -0.1598 -0.1606 -0.3559 -0.4891 0.1719 -0.3059 -0.4161 -0.2240 0.0725 0.1054 -0.2055 -0.0063 0.4855 -0.1891 -0.0187 -0.0517 -0.1450 -0.1063 0.3608 0.2680 -0.1935 -0.1815 0.4684 -0.2093 -0.1717 -0.0978 0.2371 0.1767 0.1146 0.1307 0.1476 0.1291 0.1361 0.1429 0.1408 0.1580 0.1551 0.1569 0.1596 0.1974 0.1950
va: 1.2517 1.1241 1.1254 1.1428 1.1563 1.1572 1.9654 2.0349 3.3872 2.9645 3.0482 3.2162 3.7480 3.4985 3.9475 3.9645 3.5955 4.0469 3.9736 3.8802 3.4692 3.9923 4.2660 3.7355 3.9333 3.8931 4.4073 3.9307 3.9278 3.8512 4.4096 0.9769 0.9931 0.9871 1.0184 0.9960 1.0094 1.0052 1.0222 1.0000 0.9953 0.9938 0.9885 1.0147 1.0026
dispcorr: -0.025256128 hartree
energy: -2061.601450039633
dipole: -22.35063 23.70182 1.35119 0.90108 -0.55661 0.34447 -12.91250 11.36916 -1.54334
magnitude: 2.07997 au
magnitude: 5.28685 debye
