program: Orca
programVersion: 5.0.2
elementType: Cl F F F F F O O N N N N C C C C C C C C C C C C C C C C C C C H H H H H H H H H H H H H H
charge: 0
multiplicity: 1
keywords: wb97x-d3
keywords: def2-TZVPP
keywords: def2/J RIJCOSX
keywords: DEFGRID2
keywords: scfconv7
keywords: smallprint printgap noloewdin
keywords: NOSOSCF
formula: C19H14ClF5N4O2
InChI: InChI=1/C19H14ClF5N4O2/c20-14-7-6-13(8-12(14)9-31-10-18(21,22)19(23,24)25)29-17(11-4-2-1-3-5-11)27-16(28-29)15(26)30/h1-8H,9-10,26H2
45 atoms
Cl 1.824716 -3.432533 1.449965
F  5.025892 0.067063 -0.72154
F  3.791247 1.814495 -0.299817
F  2.617966 0.236853 1.803055
F  4.664503 0.888931 1.949175
F  4.226997 -1.159802 1.465802
O  2.721707 -1.497714 -0.923018
O  -6.932868 1.243498 -0.792489
N  -2.803499 -0.103656 -0.042771
N  -4.035958 -0.547742 0.194973
N  -4.116707 1.430463 -0.83585
N  -6.799692 -0.694916 0.371666
C  -1.683634 -0.896136 0.305532
C  0.420378 -1.90938 -0.299124
C  -0.68927 -1.141569 -0.629105
C  1.516843 -2.127838 -1.307626
C  -2.859977 1.101957 -0.656504
C  -1.600098 -1.425528 1.58243
C  0.489054 -2.436956 0.989386
C  2.685276 -0.103533 -1.02981
C  -1.714212 1.925743 -1.044003
C  -0.510389 -2.208361 1.921229
C  3.832243 0.463552 -0.221336
C  -4.792387 0.400617 -0.297838
C  -0.625082 2.115011 -0.194739
C  -1.74647 2.570385 -2.279109
C  3.834645 0.092718 1.277459
C  0.4242 2.931643 -0.587088
C  -0.690908 3.378974 -2.668769
C  0.397249 3.559044 -1.825648
C  -6.279741 0.359211 -0.263938
H  -0.770707 -0.740364 -1.631792
H  1.746684 -3.189495 -1.407533
H  1.18488 -1.7745 -2.290437
H  -2.374533 -1.23144 2.312266
H  2.800483 0.231887 -2.069756
H  1.751143 0.329662 -0.655509
H  -0.440602 -2.63055 2.914316
H  -0.599587 1.647958 0.781447
H  -2.594497 2.431334 -2.937172
H  1.260382 3.083287 0.082019
H  -0.720223 3.869544 -3.632853
H  1.21989 4.192986 -2.130301
H  -6.221577 -1.394475 0.807546
H  -7.799598 -0.797064 0.444112
elementType: Cl F O N C H
totalener: -2061.57433410 hartree
nucrepener: 3422.05876228 hartree
electener: -5483.63309638 hartree
oneelecener: -9640.74464240 hartree
twoeener: 4157.11154602 hartree
cpcmener: -0.04774734 hartree
kineticenergy: 2054.87645856 hartree
xcener: -164.585202863910 hartree
chargesum: 0.0000000
charge: -0.073157 -0.187844 -0.187596 -0.167236 -0.161684 -0.154753 -0.340140 -0.484979 0.175936 -0.347063 -0.380030 -0.224057 0.070439 0.021843 -0.149416 0.023701 0.461236 -0.181569 -0.001180 -0.025603 -0.133609 -0.105060 0.364899 0.266016 -0.166746 -0.173971 0.457301 -0.223170 -0.191253 -0.087781 0.242740 0.155997 0.127220 0.109352 0.149838 0.132307 0.082074 0.142349 0.158329 0.143431 0.155951 0.156421 0.161349 0.196718 0.192453
qa: -0.0732 -0.1878 -0.1876 -0.1672 -0.1617 -0.1548 -0.3401 -0.4850 0.1759 -0.3471 -0.3800 -0.2241 0.0704 0.0218 -0.1494 0.0237 0.4612 -0.1816 -0.0012 -0.0256 -0.1336 -0.1051 0.3649 0.2660 -0.1667 -0.1740 0.4573 -0.2232 -0.1913 -0.0878 0.2427 0.1560 0.1272 0.1094 0.1498 0.1323 0.0821 0.1423 0.1583 0.1434 0.1560 0.1564 0.1613 0.1967 0.1925
va: 1.2511 1.1258 1.1166 1.1396 1.1537 1.1615 1.9722 2.0385 3.3570 2.8855 3.1115 3.2204 3.6754 3.5752 3.8923 3.9126 3.6496 4.0480 3.9056 3.9711 3.4727 4.0066 4.2097 3.7579 3.8313 3.9783 4.4302 3.9011 3.9670 3.8565 4.3887 0.9971 0.9932 0.9971 1.0124 1.0097 1.0061 1.0068 1.0026 1.0215 1.0064 0.9943 0.9884 1.0105 1.0049
dispcorr: -0.026653920 hartree
energy: -2061.600988021014
dipole: -32.40963 33.17733 0.76769 6.75868 -8.29983 -1.54115 -14.74031 14.83144 0.09113
magnitude: 1.72418 au
magnitude: 4.38251 debye
