program: Orca
programVersion: 5.0.2
elementType: Cl F F F F F O O N N N N C C C C C C C C C C C C C C C C C C C H H H H H H H H H H H H H H
charge: 0
multiplicity: 1
keywords: wb97x-d3
keywords: def2-TZVPP
keywords: def2/J RIJCOSX
keywords: DEFGRID2
keywords: scfconv7
keywords: smallprint printgap noloewdin
keywords: NOSOSCF
formula: C19H14ClF5N4O2
InChI: InChI=1/C19H14ClF5N4O2/c20-14-7-6-13(8-12(14)9-31-10-18(21,22)19(23,24)25)29-17(11-4-2-1-3-5-11)27-16(28-29)15(26)30/h1-8H,9-10,26H2
45 atoms
Cl 2.384058 -3.126515 -1.956061
F  4.697399 -1.158176 2.133919
F  5.232999 0.73981 3.054286
F  2.5168 1.045373 3.742896
F  3.585204 -0.622551 4.589677
F  2.171638 -0.953915 3.005003
O  2.633609 0.44701 0.616704
O  -3.143288 2.337574 2.846287
N  -2.104023 0.440106 -0.607923
N  -2.180133 0.933275 0.626649
N  -3.926682 1.611629 -0.585577
N  -4.907647 3.031202 1.60255
C  -1.034907 -0.425766 -0.945453
C  1.312411 -0.939615 -0.777006
C  0.237919 -0.10685 -0.495854
C  2.693724 -0.652738 -0.259349
C  -3.160674 0.862026 -1.343518
C  -1.270757 -1.580324 -1.672956
C  1.068842 -2.074607 -1.547411
C  3.844492 0.858316 1.176641
C  -3.427243 0.555605 -2.750459
C  -0.201711 -2.400071 -1.990001
C  4.228154 0.079759 2.42996
C  -3.287529 1.627464 0.599254
C  -2.42756 0.609329 -3.720337
C  -4.731608 0.235139 -3.122269
C  3.098625 -0.116951 3.459171
C  -2.731591 0.32794 -5.042899
C  -5.028104 -0.050043 -4.44553
C  -4.028538 -0.007857 -5.407537
C  -3.767902 2.364433 1.798204
H  0.385564 0.793605 0.082903
H  3.074976 -1.550539 0.237146
H  3.373105 -0.439588 -1.095441
H  -2.267403 -1.858229 -1.985582
H  4.68191 0.791397 0.470322
H  3.732225 1.908877 1.450675
H  -0.367647 -3.301565 -2.563696
H  -1.415703 0.884912 -3.452971
H  -5.512505 0.197513 -2.373816
H  -1.952266 0.375638 -5.792041
H  -6.04172 -0.307132 -4.723846
H  -4.260822 -0.23201 -6.440522
H  -5.381593 3.014955 0.714381
H  -5.322624 3.558381 2.354647
elementType: Cl F O N C H
totalener: -2061.57598283 hartree
nucrepener: 3255.81091441 hartree
electener: -5317.38689724 hartree
oneelecener: -9310.19983457 hartree
twoeener: 3992.81293733 hartree
cpcmener: -0.04391707 hartree
kineticenergy: 2054.85491686 hartree
xcener: -164.583162180846 hartree
chargesum: 0.0000000
charge: -0.080073 -0.189383 -0.186332 -0.161433 -0.159718 -0.157838 -0.338185 -0.488472 0.169121 -0.303069 -0.417873 -0.224001 0.030447 0.071756 -0.125839 0.003882 0.488458 -0.192785 0.016318 -0.028319 -0.176178 -0.107773 0.318585 0.268955 -0.187549 -0.169602 0.460895 -0.168067 -0.191755 -0.107937 0.237895 0.135221 0.109360 0.121151 0.167944 0.120796 0.133816 0.142864 0.157878 0.142146 0.157166 0.156211 0.159851 0.196876 0.194584
qa: -0.0801 -0.1894 -0.1863 -0.1614 -0.1597 -0.1578 -0.3382 -0.4885 0.1691 -0.3031 -0.4179 -0.2240 0.0304 0.0718 -0.1258 0.0039 0.4885 -0.1928 0.0163 -0.0283 -0.1762 -0.1078 0.3186 0.2690 -0.1875 -0.1696 0.4609 -0.1681 -0.1918 -0.1079 0.2379 0.1352 0.1094 0.1212 0.1679 0.1208 0.1338 0.1429 0.1579 0.1421 0.1572 0.1562 0.1599 0.1969 0.1946
va: 1.2509 1.1100 1.1210 1.1568 1.1551 1.1558 1.9702 2.0359 3.3916 2.9652 3.0436 3.2152 3.7738 3.6101 4.0016 3.9084 3.5928 3.9904 3.9768 3.9157 3.5165 3.9872 4.1606 3.7351 3.8932 3.9733 4.4341 3.9235 3.9597 3.8753 4.4078 1.0534 0.9947 0.9912 0.9849 1.0073 1.0031 1.0060 1.0000 1.0211 0.9942 0.9948 0.9892 1.0154 1.0029
dispcorr: -0.022553000 hartree
energy: -2061.598535828540
dipole: -36.31331 35.60133 -0.71198 8.84687 -8.91637 -0.06950 -34.35338 30.46233 -3.89105
magnitude: 3.95626 au
magnitude: 10.05602 debye
