program: Gaussian 09
title: 000055279
version: EM64L-G09RevD.01
frameworkgroup: C1[X(C18H12O)]
method: RPBEPBE
basis: SDD
operation: Freq
keyword: #pfreq=noraman
keyword: PBEPBE/SDD
title: #p freq=noraman PBEPBE/SDD
converged: NO YES NO NO
title: Mulliken charges:
elementType: O C C C C C C C C C C C C C C C C C C H H H H H H H H H H H H
charge: -0.479788 0.075087 0.323787 0.126995 0.194616 0.527690 0.437532 0.223544 -0.449499 -0.783494 -0.524103 -0.338136 -0.363958 -0.463739 -0.448941 -0.268646 -0.257266 -0.252271 -0.253117 0.223086 0.217497 0.236589 0.220586 0.318808 0.243073 0.240979 0.227349 0.224677 0.229049 0.228420 0.363593
chargesum: 0.00000
title: Mulliken charges with hydrogens summed into heavy atoms:
elementType: O C C C C C C C C C C C C C C C C C C
charge: -0.116194 0.075087 0.323787 0.126995 0.194616 0.527690 0.437532 0.223544 -0.226413 -0.565997 -0.287514 -0.117550 -0.045150 -0.220666 -0.207962 -0.041297 -0.032589 -0.023222 -0.024697
polarizability: 3.75557954e+02 -4.60738788e+00 2.13076678e+02 -7.81080027e-04 2.84207015e-03 7.41184118e+01
1716.lowfreq: -10.0775 -2.7389 -0.0003 0.0003 0.0006 10.2887 41.0810 74.2875 99.3368
frequency: 41.0553 74.2867 99.3285 158.7753 193.4006 205.6220 280.0884 288.1138 316.4791 325.3788 372.4478 383.5173 401.5722 430.0484 458.6625 495.4520 496.9627 517.8514 536.6396 555.6948 569.7263 584.0950 622.3501 640.5014 670.4578 707.9607 709.6316 749.7977 757.3819 777.5339 821.1514 828.8175 835.6407 852.2308 855.1773 892.0237 894.6610 902.8411 952.8585 968.0751 984.0517 988.4309 990.1894 1004.9798 1029.6241 1039.1634 1053.3484 1104.3690 1140.1950 1165.3726 1174.9935 1181.3446 1190.1991 1219.6476 1237.6886 1269.5833 1270.5734 1281.8852 1317.1863 1330.7962 1383.9175 1398.0719 1411.2503 1424.8172 1434.9024 1446.4541 1449.8858 1493.6626 1526.9873 1533.1612 1572.8593 1603.3290 1613.6311 1627.5410 1628.4299 3097.5156 3119.8453 3120.8424 3125.9525 3133.2437 3134.0904 3150.0507 3157.0963 3163.8493 3174.6989 3220.8313 3561.6785
redmass: 5.0620 4.0005 4.4161 4.6344 5.0263 3.9388 4.0706 6.5134 3.5442 6.0832 5.2028 1.2122 3.2565 7.3609 3.2154 5.8212 3.3905 3.0585 6.5783 6.3284 3.3699 5.6947 3.2087 6.5183 6.0560 5.8933 3.5606 1.5436 1.3965 1.6832 1.9844 1.4560 5.2229 1.6932 5.5515 5.1679 1.7182 2.5075 1.4091 1.3703 1.4121 1.3547 6.8313 1.3330 3.9469 2.2230 2.4334 2.4026 1.5779 1.2991 1.0909 1.1584 1.3187 1.4351 2.0884 1.7575 1.7446 2.7522 1.8229 3.3790 4.2065 4.5999 4.7783 2.6872 2.8979 2.4681 2.1282 3.3921 4.1547 3.8473 7.5823 6.6299 6.1440 6.3483 6.8121 1.0910 1.0865 1.0864 1.0886 1.0909 1.0889 1.0948 1.0992 1.0999 1.0925 1.0926 1.0655
irintensity: 0.0236 0.3305 1.6600 0.3386 0.6457 7.0727 2.1948 0.6233 6.4488 7.5207 0.0734 97.0450 2.2115 3.6232 20.0321 2.7266 11.3162 6.6064 4.9735 5.2700 0.0733 8.3141 15.1395 14.1352 2.1590 0.4963 2.0724 22.1023 4.2158 102.5280 36.5223 40.6273 0.4910 14.8922 4.5573 2.1238 14.3944 13.8699 3.5042 4.1174 1.2151 1.8319 26.1147 1.4148 22.0866 19.6498 21.5970 51.2121 2.1294 39.3968 17.4008 0.8427 32.5679 74.4579 7.4566 9.2628 0.6489 9.8395 5.7882 12.6539 0.8285 8.3445 3.8734 3.9858 11.1877 22.3386 2.2056 13.7537 2.6176 7.2726 11.2260 29.3533 1.8624 2.4508 27.6565 18.6533 0.5900 5.7706 5.2544 18.3842 19.4113 24.7780 44.9731 26.3984 32.9031 13.8403 31.5901
temp: 298.150 k
press: 1.00000 atm
elementType: 8 6 6 6 6 6 6 6 6 6 6 6 6 6 6 6 6 6 6 1 1 1 1 1 1 1 1 1 1 1 1
symmnumber: 1
zpe: 633461.6 jmol-1
zpe.correction: 0.241273 hartree
zpe.thermalcorrener: 0.254828 hartree
zpe.thermalcorrenthalpy: 0.255772 hartree
zpe.thermalcorrgfe: 0.201225 hartree
zpe.sumelectzpe: -767.105952 hartree
zpe.sumelectthermal: -767.092397 hartree
zpe.sumelectthermalent: -767.091453 hartree
zpe.sumelectthermalfe: -767.146000 hartree
dipole: 1.0025 0.9189 0.0001
dipole: 1.3600
quadrupole: -95.9493 -86.9124 -118.4487
quadrupole: 3.8476 -0.0001 0.0006
quadrupole: 4.4875 13.5244 -18.0119 3.8476 -0.0001 0.0006
hfenergy: -767.3472248 hartree
pointgroup: C01 [X(C18H12O1)]
dipole: 0.3975429 0.3581143 0.0000248 debye
polarizability: 375.4661168|-6.0117746|213.1685151|-0.0007565|0.0028487|74.1184118 unknown
InChI: InChI=1S/C18H12O/c19-17-11-13-6-2-3-7-14(13)16-10-9-12-5-1-4-8-15(12)18(16)17/h1-11,19H
charge 0 multiplicity 1
31 atoms
O  -0.618877 2.915575 -0.000064
C  -0.420797 0.457431 -0.000017
C  0.472272 -0.676391 -0.000047
C  1.926002 -0.510121 -0.00001
C  -1.873766 0.239392 0.000009
C  2.478809 0.821156 -0.000042
C  -2.377012 -1.119724 -0.000087
C  0.205332 1.771287 -0.000043
C  -0.090222 -2.004018 -0.000136
C  1.584839 1.937588 -0.000083
C  -1.453705 -2.220117 -0.000177
C  2.844515 -1.609098 0.000074
C  -2.852139 1.290853 0.000152
C  3.897765 1.011053 -0.000023
C  -3.78382 -1.374453 -0.000074
C  4.229842 -1.40609 0.0001
C  -4.226326 1.015163 0.00018
C  4.765308 -0.083886 0.000042
C  -4.706185 -0.325139 0.000055
H  0.577826 -2.868408 -0.000197
H  2.010826 2.95105 -0.000136
H  -1.852872 -3.241317 -0.000273
H  2.473376 -2.637571 0.00014
H  -2.5136 2.324768 0.000236
H  4.29397 2.03346 -0.000057
H  -4.12516 -2.416641 -0.000159
H  4.906366 -2.267679 0.000172
H  -4.93886 1.847893 0.0003
H  5.850194 0.067893 0.000059
H  -5.782688 -0.527979 0.000063
H  -0.060615 3.73337 -0.00006
