program: Orca
programVersion: 5.0.2
elementType: Cl F F F F F O O N N N N C C C C C C C C C C C C C C C C C C C H H H H H H H H H H H H H H
charge: 0
multiplicity: 1
keywords: wb97x-d3
keywords: def2-TZVPP
keywords: def2/J RIJCOSX
keywords: DEFGRID2
keywords: scfconv7
keywords: smallprint printgap noloewdin
keywords: NOSOSCF
formula: C19H14ClF5N4O2
InChI: InChI=1/C19H14ClF5N4O2/c20-14-7-6-13(8-12(14)9-31-10-18(21,22)19(23,24)25)29-17(11-4-2-1-3-5-11)27-16(28-29)15(26)30/h1-8H,9-10,26H2
45 atoms
Cl 1.545952 -4.464689 -1.240369
F  5.219931 0.353975 1.395302
F  4.922742 1.73453 -0.269109
F  2.622499 2.647322 0.96117
F  4.448502 2.875233 2.082607
F  3.026219 1.362804 2.64329
O  2.80273 -0.824059 0.93609
O  -1.04122 4.323554 -1.064351
N  -1.800564 0.342508 -0.638581
N  -1.257016 1.544299 -0.818675
N  -3.449241 1.731492 -0.438011
N  -3.270404 4.498406 -0.687338
C  -1.002463 -0.818052 -0.784284
C  1.035921 -1.989562 -0.264052
C  0.21136 -0.881462 -0.120078
C  2.35742 -2.066509 0.460168
C  -3.127404 0.459979 -0.397729
C  -1.429171 -1.853296 -1.59953
C  0.581083 -3.036121 -1.061887
C  3.387008 -0.005914 -0.039662
C  -4.054731 -0.637672 -0.119535
C  -0.634195 -2.977989 -1.724045
C  4.280798 0.995084 0.664573
C  -2.280412 2.348714 -0.69352
C  -3.707578 -1.694944 0.7205
C  -5.327523 -0.596783 -0.685867
C  3.578166 1.986905 1.609867
C  -4.620604 -2.706076 0.97433
C  -6.234691 -1.61309 -0.431443
C  -5.88221 -2.670914 0.395409
C  -2.129661 3.821067 -0.834285
H  0.514489 -0.059905 0.516224
H  2.254968 -2.715394 1.334042
H  3.11675 -2.521915 -0.186187
H  -2.363308 -1.792229 -2.140605
H  4.023939 -0.58273 -0.723307
H  2.648587 0.521535 -0.653604
H  -0.9564 -3.799215 -2.349343
H  -2.735076 -1.725958 1.194394
H  -5.603314 0.224184 -1.335051
H  -4.346325 -3.520694 1.631581
H  -7.217791 -1.578755 -0.882343
H  -6.591228 -3.464484 0.592519
H  -4.14166 4.0270 -0.505609
H  -3.279768 5.502239 -0.775266
elementType: Cl F O N C H
totalener: -2061.57673869 hartree
nucrepener: 3284.65120900 hartree
electener: -5346.22794769 hartree
oneelecener: -9367.45977052 hartree
twoeener: 4021.23182282 hartree
cpcmener: -0.04450239 hartree
kineticenergy: 2054.88009179 hartree
xcener: -164.587334409475 hartree
chargesum: 0.0000000
charge: -0.079412 -0.186720 -0.185966 -0.163275 -0.159906 -0.159800 -0.356135 -0.489393 0.177301 -0.309219 -0.417254 -0.223935 0.049951 0.077295 -0.178689 -0.000241 0.475036 -0.194975 0.004622 -0.023678 -0.153464 -0.091100 0.336689 0.267908 -0.194596 -0.171041 0.465576 -0.164139 -0.188591 -0.111638 0.238756 0.140961 0.131128 0.111215 0.164649 0.130452 0.124683 0.143695 0.155387 0.141435 0.157463 0.156703 0.160541 0.197186 0.194536
qa: -0.0794 -0.1867 -0.1860 -0.1633 -0.1599 -0.1598 -0.3561 -0.4894 0.1773 -0.3092 -0.4173 -0.2239 0.0500 0.0773 -0.1787 -0.0002 0.4750 -0.1950 0.0046 -0.0237 -0.1535 -0.0911 0.3367 0.2679 -0.1946 -0.1710 0.4656 -0.1641 -0.1886 -0.1116 0.2388 0.1410 0.1311 0.1112 0.1646 0.1305 0.1247 0.1437 0.1554 0.1414 0.1575 0.1567 0.1605 0.1972 0.1945
va: 1.2504 1.1237 1.1226 1.1538 1.1572 1.1568 1.9696 2.0347 3.3739 2.9559 3.0494 3.2164 3.7235 3.5767 3.9941 3.9542 3.6118 3.9990 3.9658 3.8671 3.5106 3.9660 4.2769 3.7365 3.8973 3.9739 4.4312 3.9165 3.9577 3.8773 4.4068 1.0367 0.9869 0.9965 0.9903 1.0074 1.0004 1.0052 1.0015 1.0218 0.9940 0.9947 0.9890 1.0153 1.0030
dispcorr: -0.022844401 hartree
energy: -2061.599583088774
dipole: -44.09117 41.16766 -2.92351 -13.04728 10.20843 -2.83886 -8.61456 8.11443 -0.50013
magnitude: 4.10563 au
magnitude: 10.43567 debye
