program: Orca
programVersion: 5.0.2
elementType: Cl F F F F F O O N N N N C C C C C C C C C C C C C C C C C C C H H H H H H H H H H H H H H
charge: 0
multiplicity: 1
keywords: wb97x-d3
keywords: def2-TZVPP
keywords: def2/J RIJCOSX
keywords: DEFGRID2
keywords: scfconv7
keywords: smallprint printgap noloewdin
keywords: NOSOSCF
formula: C19H14ClF5N4O2
InChI: InChI=1/C19H14ClF5N4O2/c20-14-7-6-13(8-12(14)9-31-10-18(21,22)19(23,24)25)29-17(11-4-2-1-3-5-11)27-16(28-29)15(26)30/h1-8H,9-10,26H2
45 atoms
Cl 2.158733 -3.212914 -0.814246
F  3.787628 1.562622 2.047447
F  4.467076 -0.217424 3.104678
F  4.841916 -1.519093 0.778612
F  5.754884 0.422059 0.739755
F  3.913839 0.082274 -0.329305
O  2.348555 -1.659862 1.956528
O  -5.946027 -0.281796 2.185086
N  -2.709849 0.058783 -0.260269
N  -3.613731 -0.298152 0.649147
N  -4.319443 1.489551 -0.485994
N  -6.682065 1.506086 1.000141
C  -1.534628 -0.714839 -0.409897
C  0.315593 -1.854512 0.636518
C  -0.827643 -1.07373 0.726948
C  1.061079 -2.231343 1.888879
C  -3.135061 1.15074 -0.938803
C  -1.11422 -1.125186 -1.663572
C  0.742227 -2.239991 -0.633192
C  2.344069 -0.266589 2.058178
C  -2.40283 1.854187 -1.993398
C  0.038472 -1.884332 -1.772666
C  3.780612 0.209502 2.02076
C  -4.564194 0.583216 0.479155
C  -1.035553 2.109894 -1.894402
C  -3.109251 2.30628 -3.106592
C  4.587705 -0.219061 0.778831
C  -0.383947 2.792355 -2.909598
C  -2.450985 2.983667 -4.120486
C  -1.086974 3.22357 -4.026556
C  -5.797806 0.555297 1.308893
H  -1.168826 -0.745089 1.700796
H  0.462493 -1.945597 2.7617
H  1.207266 -3.31149 1.937018
H  -1.676448 -0.873591 -2.552661
H  1.795376 0.217356 1.24194
H  1.894165 0.07846 2.999602
H  0.374448 -2.210556 -2.747335
H  -0.476869 1.797007 -1.021551
H  -4.172079 2.116962 -3.183975
H  0.676124 2.992146 -2.824471
H  -3.004826 3.322236 -4.986353
H  -0.573091 3.751015 -4.819741
H  -6.501993 2.175428 0.269405
H  -7.550665 1.573161 1.50672
elementType: Cl F O N C H
totalener: -2061.57587312 hartree
nucrepener: 3310.72412400 hartree
electener: -5372.29999712 hartree
oneelecener: -9418.72233978 hartree
twoeener: 4046.42234266 hartree
cpcmener: -0.04573609 hartree
kineticenergy: 2054.89717115 hartree
xcener: -164.588798496239 hartree
chargesum: -0.0000000
charge: -0.073087 -0.187747 -0.187495 -0.154308 -0.161885 -0.166067 -0.334303 -0.489597 0.169831 -0.303901 -0.417915 -0.224084 0.023438 -0.084552 -0.059629 0.023785 0.477546 -0.163994 0.060963 -0.035851 -0.147851 -0.121843 0.345369 0.266233 -0.208439 -0.177542 0.460864 -0.159643 -0.184447 -0.114979 0.239291 0.135609 0.110292 0.124402 0.167324 0.110350 0.125783 0.143211 0.167185 0.140983 0.156724 0.157384 0.159942 0.197754 0.194897
qa: -0.0731 -0.1877 -0.1875 -0.1543 -0.1619 -0.1661 -0.3343 -0.4896 0.1698 -0.3039 -0.4179 -0.2241 0.0234 -0.0846 -0.0596 0.0238 0.4775 -0.1640 0.0610 -0.0359 -0.1479 -0.1218 0.3454 0.2662 -0.2084 -0.1775 0.4609 -0.1596 -0.1844 -0.1150 0.2393 0.1356 0.1103 0.1244 0.1673 0.1104 0.1258 0.1432 0.1672 0.1410 0.1567 0.1574 0.1599 0.1978 0.1949
va: 1.2514 1.1188 1.1246 1.1633 1.1527 1.1473 1.9624 2.0344 3.3807 2.9651 3.0473 3.2167 3.7353 3.6452 3.9006 3.8980 3.6134 3.9770 3.8941 3.9396 3.4963 4.0088 4.2483 3.7392 3.9006 3.9825 4.4367 3.9196 3.9530 3.8835 4.4066 1.0251 0.9987 0.9927 0.9869 1.0006 1.0060 1.0072 0.9954 1.0222 0.9944 0.9943 0.9893 1.0145 1.0028
dispcorr: -0.023689662 hartree
energy: -2061.599562780931
dipole: -41.92995 41.25986 -0.67009 12.64523 -10.86679 1.77844 -13.79850 11.53275 -2.26575
magnitude: 2.95728 au
magnitude: 7.51680 debye
