program: Orca
programVersion: 5.0.2
elementType: Cl F F F F F O O N N N N C C C C C C C C C C C C C C C C C C C H H H H H H H H H H H H H H
charge: 0
multiplicity: 1
keywords: wb97x-d3
keywords: def2-TZVPP
keywords: def2/J RIJCOSX
keywords: DEFGRID2
keywords: scfconv7
keywords: smallprint printgap noloewdin
keywords: NOSOSCF
formula: C19H14ClF5N4O2
InChI: InChI=1/C19H14ClF5N4O2/c20-14-7-6-13(8-12(14)9-31-10-18(21,22)19(23,24)25)29-17(11-4-2-1-3-5-11)27-16(28-29)15(26)30/h1-8H,9-10,26H2
45 atoms
Cl 1.318083 -4.751734 -0.329503
F  2.467138 -0.196481 -0.448793
F  1.78571 1.35304 0.924461
F  3.728148 2.144554 -0.790371
F  5.05714 0.614278 -0.061944
F  4.377724 2.178982 1.260182
O  1.901847 -1.143734 2.150478
O  -6.458135 -0.251647 0.885903
N  -2.509732 -0.284776 -0.131779
N  -3.754048 -0.584084 0.23866
N  -3.547179 1.61433 -0.083847
N  -6.220949 1.98442 0.594124
C  -1.548423 -1.325971 -0.209357
C  0.496964 -2.332111 0.564127
C  -0.422589 -1.290084 0.597103
C  1.707349 -2.35828 1.46358
C  -2.390203 1.046633 -0.337935
C  -1.793226 -2.390427 -1.060506
C  0.227979 -3.403987 -0.283207
C  3.053288 -0.415192 1.835866
C  -1.209461 1.766164 -0.814251
C  -0.894866 -3.440674 -1.093724
C  2.81099 0.513334 0.654573
C  -4.341709 0.584333 0.257292
C  -0.358208 1.238414 -1.783737
C  -0.994711 3.061276 -0.342532
C  4.017468 1.381759 0.25829
C  0.689864 2.001534 -2.274462
C  0.057001 3.816376 -0.833353
C  0.898149 3.290746 -1.80461
C  -5.778802 0.72486 0.611473
H  -0.274624 -0.456209 1.269425
H  1.566673 -3.144635 2.213212
H  2.596602 -2.636373 0.889414
H  -2.674201 -2.406839 -1.687943
H  3.309458 0.185857 2.710961
H  3.906764 -1.067223 1.624075
H  -1.071181 -4.28344 -1.747892
H  -0.522438 0.246488 -2.184247
H  -1.654133 3.47774 0.407767
H  1.337262 1.5898 -3.037377
H  0.216116 4.819611 -0.459958
H  1.710761 3.887649 -2.197628
H  -5.615723 2.75068 0.347135
H  -7.184422 2.187082 0.808618
elementType: Cl F O N C H
totalener: -2061.57414193 hartree
nucrepener: 3444.44980485 hartree
electener: -5506.02394678 hartree
oneelecener: -9686.90173406 hartree
twoeener: 4180.87778728 hartree
cpcmener: -0.04402408 hartree
kineticenergy: 2054.86382178 hartree
xcener: -164.584392472935 hartree
chargesum: 0.0000000
charge: -0.079968 -0.204505 -0.196367 -0.153963 -0.161949 -0.161933 -0.364249 -0.490295 0.181777 -0.304507 -0.418472 -0.224657 0.005028 0.075082 -0.129235 0.017360 0.458488 -0.199744 0.008683 -0.006365 -0.101871 -0.096964 0.354035 0.262260 -0.203765 -0.179158 0.467281 -0.194871 -0.176732 -0.113601 0.241578 0.143251 0.131145 0.112226 0.148831 0.134426 0.122996 0.142853 0.157218 0.140050 0.154307 0.154971 0.157670 0.197717 0.193938
qa: -0.0800 -0.2045 -0.1964 -0.1540 -0.1619 -0.1619 -0.3642 -0.4903 0.1818 -0.3045 -0.4185 -0.2247 0.0050 0.0751 -0.1292 0.0174 0.4585 -0.1997 0.0087 -0.0064 -0.1019 -0.0970 0.3540 0.2623 -0.2038 -0.1792 0.4673 -0.1949 -0.1767 -0.1136 0.2416 0.1433 0.1311 0.1122 0.1488 0.1344 0.1230 0.1429 0.1572 0.1401 0.1543 0.1550 0.1577 0.1977 0.1939
va: 1.2522 1.0922 1.1098 1.1551 1.1568 1.1568 1.9907 2.0337 3.3709 2.9669 3.0519 3.2150 3.7467 3.5138 3.9338 3.9192 3.6429 4.0571 3.9578 4.0000 3.4710 3.9747 4.0148 3.7496 3.8792 3.9869 4.4932 3.9047 3.9497 3.8362 4.4065 1.0410 0.9880 0.9959 1.0116 1.0063 1.0042 1.0049 0.9997 1.0245 0.9971 0.9948 0.9913 1.0148 1.0033
dispcorr: -0.026736239 hartree
energy: -2061.600878170040
dipole: -22.24550 25.26669 3.02119 5.58750 -4.45507 1.13242 -1.40307 0.99334 -0.40973
magnitude: 3.25236 au
magnitude: 8.26684 debye
