program: Orca
programVersion: 5.0.2
elementType: Cl F F F F F O O N N N N C C C C C C C C C C C C C C C C C C C H H H H H H H H H H H H H H
charge: 0
multiplicity: 1
keywords: wb97x-d3
keywords: def2-TZVPP
keywords: def2/J RIJCOSX
keywords: DEFGRID2
keywords: scfconv7
keywords: smallprint printgap noloewdin
keywords: NOSOSCF
formula: C19H14ClF5N4O2
InChI: InChI=1/C19H14ClF5N4O2/c20-14-7-6-13(8-12(14)9-31-10-18(21,22)19(23,24)25)29-17(11-4-2-1-3-5-11)27-16(28-29)15(26)30/h1-8H,9-10,26H2
45 atoms
Cl 1.398069 -4.31134 0.062683
F  4.066634 -0.593235 -0.518676
F  3.775548 1.483193 -1.110428
F  4.651856 0.141114 1.997524
F  4.153486 2.200356 1.572435
F  5.805517 1.251151 0.563098
O  1.846929 -0.138667 1.433965
O  -6.98258 -0.517835 0.495046
N  -2.929517 -0.323145 -0.152021
N  -4.177651 -0.707093 0.115523
N  -4.107742 1.490577 -0.286171
N  -6.826119 1.712344 0.091792
C  -1.879773 -1.267309 -0.095193
C  0.356575 -1.864827 0.583466
C  -0.689513 -0.950812 0.539544
C  1.653705 -1.522413 1.279298
C  -2.896865 1.008457 -0.410692
C  -2.072956 -2.519063 -0.658038
C  0.149661 -3.115836 0.009438
C  2.144598 0.575922 0.272756
C  -1.720228 1.780238 -0.81852
C  -1.052522 -3.448021 -0.595543
C  3.627772 0.611766 -0.084054
C  -4.854443 0.408882 0.027631
C  -0.872001 1.33043 -1.828097
C  -1.485445 3.017215 -0.225596
C  4.58062 1.05655 1.039881
C  0.203186 2.106936 -2.228835
C  -0.401287 3.784743 -0.620398
C  0.446037 3.330814 -1.620852
C  -6.33098 0.464583 0.233589
H  -0.572318 0.01198 1.018654
H  1.640337 -1.936889 2.290182
H  2.489512 -1.998515 0.761318
H  -3.015588 -2.767282 -1.125076
H  1.612271 0.198298 -0.609546
H  1.805692 1.602659 0.425141
H  -1.18707 -4.432052 -1.021727
H  -1.061275 0.382968 -2.316407
H  -2.156392 3.373097 0.544844
H  0.851614 1.758349 -3.021586
H  -0.221547 4.741434 -0.148564
H  1.289581 3.931965 -1.932895
H  -6.228836 2.47988 -0.159851
H  -7.814144 1.863567 0.185037
totalener: -2061.54241764 hartree
nucrepener: 3361.12061066 hartree
electener: -5422.66302830 hartree
oneelecener: -9518.86441713 hartree
twoeener: 4096.20138884 hartree
kineticenergy: 2054.92123682 hartree
xcener: -164.590198987331 hartree
chargesum: -0.0000000
charge: -0.058867 -0.182193 -0.178913 -0.149015 -0.160076 -0.149481 -0.325925 -0.346890 0.164432 -0.274070 -0.382611 -0.245102 0.063767 0.039089 -0.201181 0.013001 0.395290 -0.149525 0.000915 -0.048712 -0.127609 -0.091244 0.320685 0.261600 -0.178267 -0.124716 0.461991 -0.181224 -0.155981 -0.105950 0.200736 0.149806 0.121488 0.114479 0.136482 0.104854 0.138502 0.125974 0.136507 0.126291 0.141612 0.132169 0.138888 0.168298 0.160695
qa: -0.0589 -0.1822 -0.1789 -0.1490 -0.1601 -0.1495 -0.3259 -0.3469 0.1644 -0.2741 -0.3826 -0.2451 0.0638 0.0391 -0.2012 0.0130 0.3953 -0.1495 0.0009 -0.0487 -0.1276 -0.0912 0.3207 0.2616 -0.1783 -0.1247 0.4620 -0.1812 -0.1560 -0.1060 0.2007 0.1498 0.1215 0.1145 0.1365 0.1049 0.1385 0.1260 0.1365 0.1263 0.1416 0.1322 0.1389 0.1683 0.1607
va: 1.2736 1.1204 1.1276 1.1717 1.1575 1.1697 1.9997 2.1848 3.3121 2.8942 3.0578 3.1600 3.7735 3.5628 3.9425 3.8995 3.6839 4.0681 4.0229 3.9060 3.5503 3.9973 4.2203 3.7023 3.8670 3.9928 4.4601 3.9224 3.9683 3.8870 4.4138 1.0169 0.9876 1.0075 1.0239 1.0152 1.0109 1.0116 1.0083 1.0259 1.0028 1.0032 0.9991 1.0377 1.0261
dispcorr: -0.026251077 hartree
energy: -2061.568668712861
dipole: -34.57361 35.32147 0.74786 9.97792 -8.79745 1.18047 -7.32492 6.56458 -0.76034
magnitude: 1.59089 au
magnitude: 4.04372 debye
