program: Orca
programVersion: 5.0.2
elementType: Cl F F F F F O O N N N N C C C C C C C C C C C C C C C C C C C H H H H H H H H H H H H H H
charge: 0
multiplicity: 1
keywords: wb97x-d3
keywords: def2-TZVPP
keywords: def2/J RIJCOSX
keywords: DEFGRID2
keywords: scfconv7
keywords: smallprint printgap noloewdin
keywords: NOSOSCF
formula: C19H14ClF5N4O2
InChI: InChI=1/C19H14ClF5N4O2/c20-14-7-6-13(8-12(14)9-31-10-18(21,22)19(23,24)25)29-17(11-4-2-1-3-5-11)27-16(28-29)15(26)30/h1-8H,9-10,26H2
45 atoms
Cl 1.769249 -3.706087 0.381843
F  3.718099 1.928794 -0.282006
F  4.790016 0.755657 1.214618
F  4.464523 -1.492176 -0.328238
F  5.341196 0.148587 -1.402942
F  3.271948 -0.367356 -1.7290
O  2.577061 -0.826563 1.604152
O  -6.967441 -0.4899 0.30019
N  -2.884034 -0.113865 0.023845
N  -4.134106 -0.564493 0.126687
N  -4.113488 1.667293 -0.035741
N  -6.856866 1.771823 0.123997
C  -1.7894 -0.999846 0.13218
C  0.309016 -1.573365 1.178541
C  -0.80224 -0.750497 1.071667
C  1.379382 -1.263297 2.191544
C  -2.877972 1.237958 -0.08792
C  -1.703421 -2.103352 -0.698844
C  0.401408 -2.661162 0.311969
C  2.474568 0.402492 0.957906
C  -1.683284 2.064347 -0.268428
C  -0.602101 -2.936681 -0.60454
C  3.804869 0.705866 0.298531
C  -4.842544 0.535709 0.090843
C  -0.659111 1.679717 -1.132395
C  -1.584349 3.273464 0.414282
C  4.234667 -0.280789 -0.806154
C  0.459015 2.481829 -1.288705
C  -0.461084 4.070158 0.259491
C  0.565713 3.673293 -0.584803
C  -6.331642 0.529926 0.183393
H  -0.896086 0.099785 1.736157
H  0.995026 -0.516048 2.899518
H  1.63409 -2.154547 2.765569
H  -2.489436 -2.310467 -1.412035
H  1.687666 0.41946 0.194698
H  2.253716 1.223539 1.656987
H  -0.518477 -3.799129 -1.250598
H  -0.736976 0.760042 -1.697627
H  -2.389192 3.581752 1.068279
H  1.246866 2.176908 -1.964446
H  -0.388294 5.004374 0.799982
H  1.44305 4.294706 -0.703522
H  -6.268405 2.576954 0.003744
H  -7.853176 1.887381 0.166123
totalener: -2061.54057729 hartree
nucrepener: 3409.62663430 hartree
electener: -5471.16721159 hartree
oneelecener: -9616.03400179 hartree
twoeener: 4144.86679021 hartree
kineticenergy: 2054.95159449 hartree
xcener: -164.592162101101 hartree
chargesum: 0.0000000
charge: -0.040855 -0.181664 -0.168345 -0.139858 -0.150479 -0.170162 -0.283736 -0.346673 0.158841 -0.266664 -0.384858 -0.245089 0.026436 -0.030257 -0.101723 0.001076 0.373667 -0.141647 0.022722 -0.033696 -0.091075 -0.092802 0.340700 0.257498 -0.168443 -0.151078 0.454836 -0.217442 -0.151038 -0.069368 0.200297 0.122739 0.092009 0.120170 0.135402 0.080172 0.102992 0.127305 0.139198 0.126842 0.144031 0.131866 0.139152 0.168153 0.160850
qa: -0.0409 -0.1817 -0.1683 -0.1399 -0.1505 -0.1702 -0.2837 -0.3467 0.1588 -0.2667 -0.3849 -0.2451 0.0264 -0.0303 -0.1017 0.0011 0.3737 -0.1416 0.0227 -0.0337 -0.0911 -0.0928 0.3407 0.2575 -0.1684 -0.1511 0.4548 -0.2174 -0.1510 -0.0694 0.2003 0.1227 0.0920 0.1202 0.1354 0.0802 0.1030 0.1273 0.1392 0.1268 0.1440 0.1319 0.1392 0.1682 0.1608
va: 1.2868 1.1215 1.1531 1.1851 1.1701 1.1393 2.0202 2.1851 3.2969 2.8994 3.0591 3.1602 3.8089 3.5547 3.8829 3.9375 3.7093 4.0560 4.0203 3.9606 3.5342 3.9974 4.2815 3.7101 3.8592 4.0069 4.4474 3.9435 3.9902 3.8966 4.4139 1.0085 0.9981 0.9967 1.0189 1.0152 1.0123 1.0123 1.0068 1.0269 1.0105 1.0020 0.9985 1.0380 1.0259
dispcorr: -0.026758359 hartree
energy: -2061.567335648390
dipole: -34.39742 34.89699 0.49957 16.25640 -14.77589 1.48052 5.49712 -5.36747 0.12965
magnitude: 1.56790 au
magnitude: 3.98529 debye
