program: Orca
programVersion: 5.0.2
elementType: Cl F F F F F O O N N N N C C C C C C C C C C C C C C C C C C C H H H H H H H H H H H H H H
charge: 0
multiplicity: 1
keywords: wb97x-d3
keywords: def2-TZVPP
keywords: def2/J RIJCOSX
keywords: DEFGRID2
keywords: scfconv7
keywords: smallprint printgap noloewdin
keywords: NOSOSCF
formula: C19H14ClF5N4O2
InChI: InChI=1/C19H14ClF5N4O2/c20-14-7-6-13(8-12(14)9-31-10-18(21,22)19(23,24)25)29-17(11-4-2-1-3-5-11)27-16(28-29)15(26)30/h1-8H,9-10,26H2
45 atoms
Cl 1.262329 -4.008096 1.762998
F  3.729932 2.113381 0.162414
F  4.042214 0.085415 0.895994
F  4.664241 -0.789309 -1.548997
F  5.756183 1.00456 -1.097167
F  4.079515 1.08564 -2.44851
O  1.885737 -0.674024 -1.086368
O  -6.806066 -0.640592 -1.333375
N  -2.945417 -0.278188 0.026217
N  -4.147115 -0.718657 -0.343623
N  -3.996918 1.492536 -0.645916
N  -6.56516 1.59884 -1.628303
C  -1.944967 -1.187978 0.434003
C  0.344261 -1.929066 0.303392
C  -0.675269 -1.085735 -0.110395
C  1.733731 -1.810767 -0.275172
C  -2.865099 1.0652 -0.146022
C  -2.245472 -2.174926 1.357431
C  0.032663 -2.91069 1.239598
C  2.118253 0.536157 -0.429809
C  -1.716698 1.90261 0.211448
C  -1.247121 -3.047064 1.753311
C  3.595523 0.805768 -0.160576
C  -4.748274 0.372779 -0.743729
C  -1.06958 1.75781 1.43709
C  -1.289689 2.886316 -0.676002
C  4.544709 0.515499 -1.339388
C  -0.002311 2.579239 1.762162
C  -0.213827 3.698175 -0.351533
C  0.435239 3.5436 0.864722
C  -6.147698 0.369112 -1.260613
H  -0.478365 -0.349457 -0.876798
H  2.471783 -1.846969 0.53202
H  1.936291 -2.673852 -0.913874
H  -3.247426 -2.268175 1.752611
H  1.737726 1.334937 -1.069399
H  1.586443 0.617615 0.526748
H  -1.460779 -3.829372 2.467953
H  -1.408196 1.01442 2.147203
H  -1.803449 3.00933 -1.620165
H  0.488254 2.467506 2.720038
H  0.116859 4.454662 -1.05056
H  1.273303 4.178869 1.117662
H  -5.969883 2.400726 -1.519786
H  -7.496956 1.717669 -1.982347
totalener: -2061.54243181 hartree
nucrepener: 3365.88673504 hartree
electener: -5427.42916685 hartree
oneelecener: -9528.37287041 hartree
twoeener: 4100.94370356 hartree
kineticenergy: 2054.92755905 hartree
xcener: -164.591366680026 hartree
chargesum: 0.0000000
charge: -0.058561 -0.177191 -0.183176 -0.150181 -0.149711 -0.158274 -0.331086 -0.347039 0.159563 -0.268953 -0.382082 -0.245645 0.053369 0.054464 -0.179662 0.001830 0.387652 -0.151918 -0.014359 -0.050544 -0.126029 -0.087263 0.314196 0.260505 -0.153863 -0.121409 0.466742 -0.194392 -0.195102 -0.065521 0.200161 0.146890 0.117282 0.126788 0.135490 0.138489 0.106289 0.125179 0.132144 0.126951 0.138170 0.132762 0.137838 0.168358 0.160851
qa: -0.0586 -0.1772 -0.1832 -0.1502 -0.1497 -0.1583 -0.3311 -0.3470 0.1596 -0.2690 -0.3821 -0.2456 0.0534 0.0545 -0.1797 0.0018 0.3877 -0.1519 -0.0144 -0.0505 -0.1260 -0.0873 0.3142 0.2605 -0.1539 -0.1214 0.4667 -0.1944 -0.1951 -0.0655 0.2002 0.1469 0.1173 0.1268 0.1355 0.1385 0.1063 0.1252 0.1321 0.1270 0.1382 0.1328 0.1378 0.1684 0.1609
va: 1.2760 1.1292 1.1183 1.1690 1.1694 1.1610 1.9916 2.1850 3.3170 2.9004 3.0593 3.1597 3.7868 3.5729 3.9343 3.9210 3.6889 4.0681 4.0399 3.9043 3.5712 3.9905 4.2357 3.7026 3.8729 3.9715 4.4572 3.9419 3.9638 3.8404 4.4147 1.0184 1.0002 0.9887 1.0220 1.0070 1.0189 1.0113 1.0090 1.0259 1.0025 1.0040 0.9991 1.0378 1.0260
dispcorr: -0.026428272 hartree
energy: -2061.568860082634
dipole: -33.88820 34.66227 0.77407 11.51038 -10.13992 1.37047 4.04993 -3.33982 0.71010
magnitude: 1.72673 au
magnitude: 4.38901 debye
