program: Orca
programVersion: 5.0.2
elementType: Cl F F F F F O O N N N N C C C C C C C C C C C C C C C C C C C H H H H H H H H H H H H H H
charge: 0
multiplicity: 1
keywords: wb97x-d3
keywords: def2-TZVPP
keywords: def2/J RIJCOSX
keywords: DEFGRID2
keywords: scfconv7
keywords: smallprint printgap noloewdin
keywords: NOSOSCF
formula: C19H14ClF5N4O2
InChI: InChI=1/C19H14ClF5N4O2/c20-14-7-6-13(8-12(14)9-31-10-18(21,22)19(23,24)25)29-17(11-4-2-1-3-5-11)27-16(28-29)15(26)30/h1-8H,9-10,26H2
45 atoms
Cl 1.395618 -4.412783 -0.028265
F  5.016527 -0.234266 -0.359819
F  3.810016 1.376843 -1.211475
F  4.923237 2.141609 1.045176
F  4.19526 0.430673 2.131143
F  2.806424 1.874196 1.338026
O  2.751792 -1.527662 0.539921
O  -6.838881 -0.156237 0.643084
N  -2.809973 -0.29064 -0.159703
N  -4.076408 -0.579378 0.139259
N  -3.833177 1.617546 -0.209997
N  -6.495535 2.064757 0.310281
C  -1.815641 -1.291476 -0.110529
C  0.369067 -2.00135 0.636403
C  -0.644985 -1.055809 0.592101
C  1.638738 -1.691709 1.384475
C  -2.671911 1.040382 -0.384232
C  -2.013949 -2.501191 -0.75332
C  0.168613 -3.203493 -0.039199
C  2.670847 -0.474789 -0.372456
C  -1.429561 1.703611 -0.785801
C  -1.016454 -3.460333 -0.711681
C  3.8667 0.451661 -0.219822
C  -4.658219 0.592373 0.101629
C  -1.061416 2.891784 -0.161929
C  -0.623482 1.179389 -1.794822
C  3.955348 1.234969 1.103607
C  0.114641 3.53093 -0.520611
C  0.545093 1.82835 -2.158044
C  0.922264 2.999139 -1.514879
C  -6.112905 0.772107 0.379856
H  -0.515308 -0.121956 1.124772
H  1.472878 -0.801027 2.003103
H  1.897177 -2.509518 2.058023
H  -2.941309 -2.695189 -1.274457
H  2.693454 -0.861378 -1.398494
H  1.754516 0.11744 -0.282622
H  -1.158746 -4.409768 -1.208344
H  -1.696237 3.305894 0.610155
H  -0.9139 0.271353 -2.307549
H  0.401798 4.446274 -0.021217
H  1.161002 1.421262 -2.948814
H  1.839774 3.498425 -1.79435
H  -5.840759 2.785007 0.061637
H  -7.457354 2.301891 0.472327
totalener: -2061.53871113 hartree
nucrepener: 3402.32675400 hartree
electener: -5463.86546513 hartree
oneelecener: -9601.26147438 hartree
twoeener: 4137.39600926 hartree
kineticenergy: 2054.94892911 hartree
xcener: -164.591839361084 hartree
chargesum: 0.0000000
charge: -0.041702 -0.167361 -0.185198 -0.149066 -0.149456 -0.165234 -0.299979 -0.347144 0.156353 -0.268696 -0.381911 -0.245418 0.033083 -0.017090 -0.127114 0.012692 0.385486 -0.136381 0.021063 -0.028499 -0.128003 -0.101239 0.369013 0.260146 -0.132623 -0.144553 0.437763 -0.156340 -0.221072 -0.068323 0.200569 0.133791 0.093998 0.119480 0.137080 0.117462 0.064027 0.126551 0.126856 0.129754 0.130573 0.137533 0.139829 0.168578 0.160723
qa: -0.0417 -0.1674 -0.1852 -0.1491 -0.1495 -0.1652 -0.3000 -0.3471 0.1564 -0.2687 -0.3819 -0.2454 0.0331 -0.0171 -0.1271 0.0127 0.3855 -0.1364 0.0211 -0.0285 -0.1280 -0.1012 0.3690 0.2601 -0.1326 -0.1446 0.4378 -0.1563 -0.2211 -0.0683 0.2006 0.1338 0.0940 0.1195 0.1371 0.1175 0.0640 0.1266 0.1269 0.1298 0.1306 0.1375 0.1398 0.1686 0.1607
va: 1.2883 1.1551 1.1179 1.1734 1.1711 1.1388 1.9985 2.1847 3.3073 2.9001 3.0588 3.1602 3.8133 3.5733 3.8839 3.9127 3.6952 4.0512 4.0175 3.9793 3.5754 4.0013 4.2355 3.7042 3.9863 3.8519 4.4482 3.9822 3.9461 3.8511 4.4138 1.0015 1.0026 0.9959 1.0203 1.0050 1.0097 1.0131 1.0250 1.0104 1.0030 1.0048 1.0010 1.0377 1.0261
dispcorr: -0.027234318 hartree
energy: -2061.565945443642
dipole: -30.51791 31.18848 0.67057 7.07352 -6.03821 1.03531 -7.36740 6.74117 -0.62623
magnitude: 1.38337 au
magnitude: 3.51624 debye
