program: Orca
programVersion: 5.0.2
elementType: Cl F F F F F O O N N N N C C C C C C C C C C C C C C C C C C C H H H H H H H H H H H H H H
charge: 0
multiplicity: 1
keywords: wb97x-d3
keywords: def2-TZVPP
keywords: def2/J RIJCOSX
keywords: DEFGRID2
keywords: scfconv7
keywords: smallprint printgap noloewdin
keywords: NOSOSCF
formula: C19H14ClF5N4O2
InChI: InChI=1/C19H14ClF5N4O2/c20-14-7-6-13(8-12(14)9-31-10-18(21,22)19(23,24)25)29-17(11-4-2-1-3-5-11)27-16(28-29)15(26)30/h1-8H,9-10,26H2
45 atoms
Cl 1.54702 -4.389197 -1.69567
F  4.644161 0.769307 1.842188
F  2.665408 1.606436 1.486135
F  3.523199 1.837773 4.058963
F  3.7596 -0.300604 4.207495
F  1.806257 0.545355 3.867026
O  3.094145 -0.655795 0.094795
O  -2.159319 2.739249 2.762301
N  -1.741347 0.360782 -0.565047
N  -1.622446 0.946685 0.627595
N  -3.227467 1.935903 -0.572699
N  -3.737164 3.722315 1.456658
C  -0.959349 -0.779898 -0.857375
C  1.202747 -1.840166 -0.861738
C  0.406348 -0.726273 -0.632872
C  2.692681 -1.789155 -0.616124
C  -2.708915 0.972424 -1.293323
C  -1.559002 -1.935088 -1.331681
C  0.591215 -2.987116 -1.358621
C  2.871954 -0.737581 1.472207
C  -3.102035 0.640683 -2.662787
C  -0.772184 -3.040696 -1.597152
C  3.32686 0.5838 2.06532
C  -2.533189 1.884677 0.584899
C  -4.444738 0.758084 -3.014874
C  -2.17277 0.255891 -3.627252
C  3.097545 0.676977 3.584389
C  -4.854853 0.470176 -4.305595
C  -2.588013 -0.030556 -4.916929
C  -3.928869 0.069604 -5.257789
C  -2.772926 2.816511 1.725203
H  0.84704 0.191857 -0.267512
H  3.017944 -2.710081 -0.114193
H  3.216686 -1.758063 -1.575026
H  -2.627557 -1.980558 -1.489566
H  1.815013 -0.899716 1.71884
H  3.44655 -1.557795 1.922322
H  -1.219592 -3.950049 -1.972694
H  -5.162132 1.074974 -2.269947
H  -1.12071 0.194883 -3.38279
H  -5.900355 0.55885 -4.568507
H  -1.859034 -0.324936 -5.659828
H  -4.249973 -0.156514 -6.265855
H  -4.193891 3.740582 0.562155
H  -3.975101 4.408998 2.149131
totalener: -2061.54201079 hartree
nucrepener: 3285.60982350 hartree
electener: -5347.15183430 hartree
oneelecener: -9368.91470373 hartree
twoeener: 4021.76286944 hartree
kineticenergy: 2054.93088450 hartree
xcener: -164.590916232246 hartree
chargesum: 0.0000000
charge: -0.062402 -0.171078 -0.168475 -0.144634 -0.164243 -0.145948 -0.300670 -0.346957 0.171907 -0.274707 -0.391565 -0.245382 0.043142 0.053360 -0.187509 -0.001413 0.401083 -0.168771 -0.005771 -0.115145 -0.144322 -0.075172 0.362205 0.258380 -0.139552 -0.171030 0.437080 -0.154394 -0.133211 -0.089501 0.203059 0.146016 0.101925 0.122116 0.141063 0.134021 0.126834 0.124778 0.124697 0.132556 0.129258 0.129531 0.131219 0.167754 0.159869
qa: -0.0624 -0.1711 -0.1685 -0.1446 -0.1642 -0.1459 -0.3007 -0.3470 0.1719 -0.2747 -0.3916 -0.2454 0.0431 0.0534 -0.1875 -0.0014 0.4011 -0.1688 -0.0058 -0.1151 -0.1443 -0.0752 0.3622 0.2584 -0.1396 -0.1710 0.4371 -0.1544 -0.1332 -0.0895 0.2031 0.1460 0.1019 0.1221 0.1411 0.1340 0.1268 0.1248 0.1247 0.1326 0.1293 0.1295 0.1312 0.1678 0.1599
va: 1.2703 1.1415 1.1395 1.1823 1.1485 1.1754 1.9989 2.1845 3.3020 2.8887 3.0533 3.1601 3.7578 3.5609 3.9737 3.9597 3.6761 4.0386 4.0347 3.9355 3.5929 3.9832 4.2522 3.7148 4.0102 3.9348 4.4559 3.9968 3.9685 3.9358 4.4108 1.0430 0.9966 0.9889 0.9989 0.9898 1.0121 1.0116 1.0298 1.0085 1.0034 1.0029 0.9988 1.0381 1.0265
dispcorr: -0.022757419 hartree
energy: -2061.564768212539
dipole: -34.16583 32.90185 -1.26399 -1.14040 -0.08240 -1.22280 -31.84397 29.55369 -2.29027
magnitude: 2.88761 au
magnitude: 7.33971 debye
