program: Orca
programVersion: 5.0.2
elementType: Cl F F F F F O O N N N N C C C C C C C C C C C C C C C C C C C H H H H H H H H H H H H H H
charge: 0
multiplicity: 1
keywords: wb97x-d3
keywords: def2-TZVPP
keywords: def2/J RIJCOSX
keywords: DEFGRID2
keywords: scfconv7
keywords: smallprint printgap noloewdin
keywords: NOSOSCF
formula: C19H14ClF5N4O2
InChI: InChI=1/C19H14ClF5N4O2/c20-14-7-6-13(8-12(14)9-31-10-18(21,22)19(23,24)25)29-17(11-4-2-1-3-5-11)27-16(28-29)15(26)30/h1-8H,9-10,26H2
45 atoms
Cl 2.836532 -1.870104 -2.587401
F  4.541419 0.525368 1.285198
F  3.816902 1.883515 2.826879
F  4.330464 -1.572803 2.898214
F  3.279658 -0.426924 4.396033
F  5.329304 0.038941 3.912544
O  1.901796 -0.878266 1.62849
O  -2.963038 3.62369 1.962271
N  -2.157593 0.666323 -0.773577
N  -2.089768 1.615954 0.16037
N  -4.196817 1.358897 -0.539241
N  -5.067628 3.350219 1.150877
C  -0.967985 0.052522 -1.225991
C  1.163021 -0.931158 -0.679896
C  -0.03798 -0.359415 -0.285938
C  2.185939 -1.363531 0.342071
C  -3.441006 0.503872 -1.182522
C  -0.7267 -0.105711 -2.580869
C  1.378571 -1.115385 -2.043026
C  2.238394 0.454353 1.882042
C  -3.917436 -0.486383 -2.148526
C  0.449326 -0.709937 -2.986635
C  3.684758 0.634398 2.329515
C  -3.332434 2.00896 0.270133
C  -4.918064 -0.120978 -3.045168
C  -3.427478 -1.790759 -2.160762
C  4.166464 -0.356439 3.406213
C  -5.404643 -1.042005 -3.957897
C  -3.91948 -2.708961 -3.072791
C  -4.90377 -2.335499 -3.97656
C  -3.747588 3.078884 1.222922
H  -0.254723 -0.22239 0.764414
H  2.183789 -2.453624 0.420012
H  3.186774 -1.082831 0.002013
H  -1.439201 0.237661 -3.317597
H  2.071057 1.114885 1.020938
H  1.587248 0.806204 2.684137
H  0.652375 -0.850723 -4.038809
H  -5.309446 0.887252 -3.022299
H  -2.672787 -2.099001 -1.449308
H  -6.177378 -0.748892 -4.655709
H  -3.536737 -3.720639 -3.071829
H  -5.284984 -3.054305 -4.68959
H  -5.668224 2.830218 0.535954
H  -5.463504 4.03904 1.764494
totalener: -2061.54259457 hartree
nucrepener: 3242.91651242 hartree
electener: -5304.45910699 hartree
oneelecener: -9283.16172096 hartree
twoeener: 3978.70261398 hartree
kineticenergy: 2054.93403393 hartree
xcener: -164.591454520549 hartree
chargesum: 0.0000000
charge: -0.059661 -0.182969 -0.171862 -0.153324 -0.157596 -0.149400 -0.325937 -0.349978 0.171723 -0.278110 -0.388690 -0.244866 0.035455 0.035138 -0.158325 0.001245 0.406424 -0.167739 0.002239 -0.052060 -0.154613 -0.083875 0.306440 0.257132 -0.136873 -0.170237 0.461797 -0.157593 -0.135420 -0.087060 0.203515 0.140366 0.122579 0.119065 0.142531 0.122550 0.135235 0.124443 0.124943 0.132484 0.129338 0.130559 0.131724 0.168312 0.160950
qa: -0.0597 -0.1830 -0.1719 -0.1533 -0.1576 -0.1494 -0.3259 -0.3500 0.1717 -0.2781 -0.3887 -0.2449 0.0355 0.0351 -0.1583 0.0012 0.4064 -0.1677 0.0022 -0.0521 -0.1546 -0.0839 0.3064 0.2571 -0.1369 -0.1702 0.4618 -0.1576 -0.1354 -0.0871 0.2035 0.1404 0.1226 0.1191 0.1425 0.1225 0.1352 0.1244 0.1249 0.1325 0.1293 0.1306 0.1317 0.1683 0.1610
va: 1.2728 1.1177 1.1416 1.1646 1.1628 1.1694 1.9832 2.1821 3.3031 2.8913 3.0528 3.1608 3.7876 3.6279 3.9789 3.9056 3.6687 4.0300 4.0283 3.9151 3.5881 3.9946 4.2286 3.7170 4.0074 3.9346 4.4410 3.9981 3.9748 3.9326 4.4138 1.0405 0.9897 1.0013 0.9966 1.0001 1.0048 1.0121 1.0280 1.0079 1.0033 1.0025 0.9987 1.0377 1.0260
dispcorr: -0.023065141 hartree
energy: -2061.565659711554
dipole: -47.99399 46.34001 -1.65398 -1.86563 0.62490 -1.24073 -26.67566 24.56282 -2.11283
magnitude: 2.95620 au
magnitude: 7.51406 debye
