program: Orca
programVersion: 5.0.2
elementType: Cl F F F F F O O N N N N C C C C C C C C C C C C C C C C C C C H H H H H H H H H H H H H H
charge: 0
multiplicity: 1
keywords: wb97x-d3
keywords: def2-TZVPP
keywords: def2/J RIJCOSX
keywords: DEFGRID2
keywords: scfconv7
keywords: smallprint printgap noloewdin
keywords: NOSOSCF
formula: C19H14ClF5N4O2
InChI: InChI=1/C19H14ClF5N4O2/c20-14-7-6-13(8-12(14)9-31-10-18(21,22)19(23,24)25)29-17(11-4-2-1-3-5-11)27-16(28-29)15(26)30/h1-8H,9-10,26H2
45 atoms
Cl 1.180449 -4.921301 0.695163
F  3.658109 1.974944 0.316466
F  4.712689 0.544421 -0.947557
F  3.59004 2.79283 -2.166455
F  1.633969 2.028445 -1.673001
F  2.963141 0.886084 -2.930933
O  2.332961 -1.014231 -1.012739
O  -6.311778 0.255785 -1.315436
N  -2.512579 -0.375226 0.131965
N  -3.727363 -0.503354 -0.401188
N  -3.332989 1.628866 0.149412
N  -5.802193 2.401202 -0.7705
C  -1.642075 -1.483487 0.226464
C  0.560683 -2.408491 -0.081725
C  -0.3417 -1.366937 -0.238614
C  1.983932 -2.29452 -0.573358
C  -2.285856 0.916244 0.479239
C  -2.094269 -2.664791 0.78912
C  0.098709 -3.584543 0.502604
C  2.64186 -0.091172 -0.010976
C  -1.091561 1.417268 1.163019
C  -1.215452 -3.725199 0.918358
C  3.49036 1.011632 -0.619735
C  -4.186586 0.72214 -0.376611
C  -0.523833 2.617303 0.745343
C  -0.542229 0.740147 2.25056
C  2.90862 1.688001 -1.879636
C  0.59218 3.122725 1.392151
C  0.565965 1.255735 2.902389
C  1.139267 2.444002 2.471039
C  -5.54692 1.079849 -0.874803
H  -0.03346 -0.459085 -0.739426
H  2.671623 -2.639441 0.210568
H  2.125512 -2.96318 -1.426136
H  -3.120438 -2.755094 1.117212
H  1.753079 0.352326 0.452157
H  3.231844 -0.545487 0.797941
H  -1.547952 -4.658394 1.350726
H  -0.958482 3.148138 -0.090843
H  -0.989442 -0.180476 2.602544
H  1.035508 4.048951 1.052978
H  0.978886 0.729545 3.75273
H  2.008796 2.841393 2.976891
H  -5.127739 3.027553 -0.367917
H  -6.695227 2.755058 -1.061846
totalener: -2061.54183617 hartree
nucrepener: 3425.70761917 hartree
electener: -5487.24945534 hartree
oneelecener: -9648.16479070 hartree
twoeener: 4160.91533536 hartree
kineticenergy: 2054.92072890 hartree
xcener: -164.590557576685 hartree
chargesum: 0.0000000
charge: -0.060645 -0.177704 -0.171476 -0.151672 -0.160680 -0.142133 -0.313628 -0.347549 0.157364 -0.271034 -0.383083 -0.245313 0.061776 0.089444 -0.197834 -0.028830 0.386387 -0.158172 -0.024735 0.014876 -0.123441 -0.077221 0.354246 0.261390 -0.130427 -0.156251 0.445424 -0.162905 -0.156058 -0.092399 0.198759 0.152903 0.102148 0.125494 0.134868 0.035732 0.110822 0.126542 0.124807 0.128560 0.131247 0.128840 0.132774 0.168582 0.160207
qa: -0.0606 -0.1777 -0.1715 -0.1517 -0.1607 -0.1421 -0.3136 -0.3475 0.1574 -0.2710 -0.3831 -0.2453 0.0618 0.0894 -0.1978 -0.0288 0.3864 -0.1582 -0.0247 0.0149 -0.1234 -0.0772 0.3542 0.2614 -0.1304 -0.1563 0.4454 -0.1629 -0.1561 -0.0924 0.1988 0.1529 0.1021 0.1255 0.1349 0.0357 0.1108 0.1265 0.1248 0.1286 0.1312 0.1288 0.1328 0.1686 0.1602
va: 1.2732 1.1255 1.1474 1.1678 1.1411 1.1816 2.0214 2.1846 3.3183 2.8990 3.0605 3.1593 3.7844 3.5257 3.9824 4.0010 3.6933 4.0719 4.0428 3.9181 3.5640 3.9767 4.2600 3.7019 3.9331 3.8841 4.4468 3.9434 3.9254 3.8686 4.4165 1.0094 0.9970 0.9892 1.0219 1.0174 1.0184 1.0104 1.0271 1.0097 1.0047 1.0038 1.0005 1.0380 1.0263
dispcorr: -0.027126529 hartree
energy: -2061.568962702469
dipole: -21.55429 22.83961 1.28532 1.37855 -1.03743 0.34113 16.55471 -14.91012 1.64459
magnitude: 2.11497 au
magnitude: 5.37582 debye
