program: Orca
programVersion: 5.0.2
elementType: Cl F F F F F O O N N N N C C C C C C C C C C C C C C C C C C C H H H H H H H H H H H H H H
charge: 0
multiplicity: 1
keywords: wb97x-d3
keywords: def2-TZVPP
keywords: def2/J RIJCOSX
keywords: DEFGRID2
keywords: scfconv7
keywords: smallprint printgap noloewdin
keywords: NOSOSCF
formula: C19H14ClF5N4O2
InChI: InChI=1/C19H14ClF5N4O2/c20-14-7-6-13(8-12(14)9-31-10-18(21,22)19(23,24)25)29-17(11-4-2-1-3-5-11)27-16(28-29)15(26)30/h1-8H,9-10,26H2
45 atoms
Cl 1.074509 -5.021158 -0.657429
F  1.531742 1.469858 1.194806
F  2.921575 1.150709 2.845648
F  3.581145 1.573106 -0.563651
F  4.983317 0.996194 0.974885
F  3.925506 2.869405 1.114497
O  2.513621 -0.894995 0.000337
O  -6.1476 0.141623 1.630636
N  -2.472322 -0.340471 -0.143948
N  -3.635799 -0.506236 0.487661
N  -3.377822 1.629911 -0.108249
N  -5.816488 2.294946 0.985062
C  -1.605111 -1.44998 -0.271544
C  0.618763 -2.378569 -0.317547
C  -0.229688 -1.286682 -0.201697
C  2.119116 -2.204117 -0.298842
C  -2.328414 0.960423 -0.515286
C  -2.158503 -2.711524 -0.434039
C  0.050312 -3.635852 -0.490562
C  2.626119 -0.614057 1.361517
C  -1.20431 1.543366 -1.251451
C  -1.322664 -3.807556 -0.540213
C  2.703998 0.89263 1.536789
C  -4.147515 0.695891 0.490953
C  -0.680896 2.754728 -0.809165
C  -0.666682 0.934663 -2.38306
C  3.817873 1.599282 0.738995
C  0.388979 3.334296 -1.470273
C  0.400866 1.519506 -3.0427
C  0.936249 2.71434 -2.582902
C  -5.476097 0.993866 1.099802
H  0.192907 -0.304146 -0.058873
H  2.574278 -2.927031 0.390592
H  2.51759 -2.431823 -1.290823
H  -3.231497 -2.835578 -0.461445
H  1.76082 -0.962165 1.943221
H  3.520663 -1.075519 1.799379
H  -1.739469 -4.796816 -0.666435
H  -1.108791 3.231828 0.062169
H  -1.082753 0.006639 -2.753628
H  0.800572 4.267739 -1.110782
H  0.815622 1.040954 -3.919536
H  1.776684 3.163407 -3.094925
H  -5.213841 2.945756 0.513027
H  -6.697303 2.609611 1.349526
totalener: -2061.54119609 hartree
nucrepener: 3414.02664974 hartree
electener: -5475.56784583 hartree
oneelecener: -9625.33978420 hartree
twoeener: 4149.77193837 hartree
kineticenergy: 2054.93076973 hartree
xcener: -164.592256875547 hartree
chargesum: -0.0000000
charge: -0.065130 -0.170625 -0.172063 -0.143184 -0.161233 -0.154221 -0.315210 -0.349615 0.162707 -0.277728 -0.385762 -0.244722 0.046313 0.057557 -0.197290 -0.014068 0.423003 -0.136134 -0.020074 -0.086520 -0.128531 -0.096647 0.331264 0.261550 -0.171999 -0.176218 0.462215 -0.153503 -0.120947 -0.089849 0.201053 0.181874 0.106201 0.121383 0.138336 0.124711 0.127609 0.125040 0.119019 0.131196 0.127372 0.126045 0.127971 0.169118 0.159737
qa: -0.0651 -0.1706 -0.1721 -0.1432 -0.1612 -0.1542 -0.3152 -0.3496 0.1627 -0.2777 -0.3858 -0.2447 0.0463 0.0576 -0.1973 -0.0141 0.4230 -0.1361 -0.0201 -0.0865 -0.1285 -0.0966 0.3313 0.2615 -0.1720 -0.1762 0.4622 -0.1535 -0.1209 -0.0898 0.2011 0.1819 0.1062 0.1214 0.1383 0.1247 0.1276 0.1250 0.1190 0.1312 0.1274 0.1260 0.1280 0.1691 0.1597
va: 1.2694 1.1254 1.1407 1.1727 1.1589 1.1635 1.9903 2.1825 3.3194 2.8934 3.0477 3.1595 3.8794 3.5477 3.9203 3.9786 3.6513 4.0517 4.0295 3.9372 3.5522 4.0094 4.2214 3.7035 3.9957 3.9373 4.4297 3.9695 3.9745 3.9137 4.4153 0.9889 0.9915 0.9880 1.0287 0.9915 1.0107 1.0114 1.0288 1.0075 1.0035 1.0027 0.9989 1.0375 1.0265
dispcorr: -0.025552333 hartree
energy: -2061.566748420715
dipole: -22.20833 23.69587 1.48754 0.99189 -0.82764 0.16425 -11.17886 10.23279 -0.94607
magnitude: 1.77054 au
magnitude: 4.50035 debye
