program: Orca
programVersion: 5.0.2
elementType: Cl F F F F F O O N N N N C C C C C C C C C C C C C C C C C C C H H H H H H H H H H H H H H
charge: 0
multiplicity: 1
keywords: wb97x-d3
keywords: def2-TZVPP
keywords: def2/J RIJCOSX
keywords: DEFGRID2
keywords: scfconv7
keywords: smallprint printgap noloewdin
keywords: NOSOSCF
formula: C19H14ClF5N4O2
InChI: InChI=1/C19H14ClF5N4O2/c20-14-7-6-13(8-12(14)9-31-10-18(21,22)19(23,24)25)29-17(11-4-2-1-3-5-11)27-16(28-29)15(26)30/h1-8H,9-10,26H2
45 atoms
Cl 1.425572 -4.018893 0.985134
F  4.755055 -0.151964 -1.118155
F  3.427228 1.572246 -1.024242
F  3.701653 1.672464 1.67226
F  5.594406 1.669991 0.643012
F  4.911848 -0.110285 1.653333
O  2.070057 -0.74222 -1.346915
O  -7.097357 -0.631943 -0.116941
N  -3.000579 -0.274951 -0.105904
N  -4.26024 -0.704233 -0.014468
N  -4.210707 1.445107 -0.626278
N  -6.956632 1.558734 -0.702354
C  -1.938071 -1.176781 0.122731
C  0.229541 -2.058039 -0.480809
C  -0.831834 -1.186603 -0.70732
C  1.415918 -1.985215 -1.410225
C  -2.978012 1.035347 -0.463139
C  -2.028113 -2.071018 1.180918
C  0.138555 -2.924776 0.603084
C  2.65539 -0.470277 -0.110132
C  -1.779887 1.861061 -0.621949
C  -0.986986 -2.945802 1.416525
C  3.82508 0.466388 -0.361675
C  -4.955608 0.355187 -0.337685
C  -1.698471 2.721906 -1.712123
C  -0.737099 1.822121 0.301525
C  4.52811 0.937142 0.924945
C  -0.57087 3.505177 -1.897363
C  0.385208 2.610002 0.114297
C  0.476388 3.443095 -0.991354
C  -6.447302 0.354116 -0.368777
H  -0.778198 -0.511638 -1.552111
H  2.11391 -2.80557 -1.217729
H  1.075213 -2.08629 -2.441833
H  -2.909225 -2.085889 1.806906
H  1.94396 -0.005897 0.583637
H  3.037772 -1.377821 0.374401
H  -1.042897 -3.642815 2.240585
H  -2.518615 2.765942 -2.416168
H  -0.804719 1.184431 1.173538
H  -0.509123 4.162106 -2.754285
H  1.190626 2.57918 0.834982
H  1.36054 4.047568 -1.140783
H  -6.354481 2.343216 -0.879192
H  -7.952448 1.679316 -0.741028
totalener: -2061.54002689 hartree
nucrepener: 3353.93572728 hartree
electener: -5415.47575416 hartree
oneelecener: -9504.53739456 hartree
twoeener: 4089.06164040 hartree
kineticenergy: 2054.93301016 hartree
xcener: -164.590247777001 hartree
chargesum: 0.0000000
charge: -0.061800 -0.170271 -0.167668 -0.162427 -0.143049 -0.158012 -0.289139 -0.347840 0.162988 -0.275550 -0.384507 -0.245005 0.034721 -0.050932 -0.144244 0.013595 0.392873 -0.130943 0.075051 -0.062861 -0.149548 -0.099599 0.342928 0.260218 -0.140597 -0.162113 0.441959 -0.161013 -0.183125 -0.053753 0.200557 0.140963 0.104228 0.105575 0.138334 0.090373 0.116829 0.126614 0.125180 0.139471 0.129016 0.141228 0.131680 0.168857 0.160759
qa: -0.0618 -0.1703 -0.1677 -0.1624 -0.1430 -0.1580 -0.2891 -0.3478 0.1630 -0.2755 -0.3845 -0.2450 0.0347 -0.0509 -0.1442 0.0136 0.3929 -0.1309 0.0751 -0.0629 -0.1495 -0.0996 0.3429 0.2602 -0.1406 -0.1621 0.4420 -0.1610 -0.1831 -0.0538 0.2006 0.1410 0.1042 0.1056 0.1383 0.0904 0.1168 0.1266 0.1252 0.1395 0.1290 0.1412 0.1317 0.1689 0.1608
va: 1.2675 1.1437 1.1334 1.1455 1.1825 1.1580 1.9771 2.1839 3.3014 2.8944 3.0509 3.1602 3.8166 3.6025 3.9429 3.9452 3.6959 4.0496 3.8888 3.9362 3.5838 4.0171 4.2991 3.7056 4.0051 3.8990 4.4438 4.0133 3.9671 3.9422 4.4144 1.0051 1.0085 0.9944 1.0232 0.9979 1.0241 1.0118 1.0267 1.0043 1.0028 1.0041 1.0015 1.0377 1.0260
dispcorr: -0.025838562 hartree
energy: -2061.565865450717
dipole: -34.06543 34.95313 0.88770 6.77539 -6.01558 0.75981 -8.20082 8.14272 -0.05810
magnitude: 1.16991 au
magnitude: 2.97368 debye
