program: Orca
programVersion: 5.0.2
elementType: Cl F F F F F O O N N N N C C C C C C C C C C C C C C C C C C C H H H H H H H H H H H H H H
charge: 0
multiplicity: 1
keywords: wb97x-d3
keywords: def2-TZVPP
keywords: def2/J RIJCOSX
keywords: DEFGRID2
keywords: scfconv7
keywords: smallprint printgap noloewdin
keywords: NOSOSCF
formula: C19H14ClF5N4O2
InChI: InChI=1/C19H14ClF5N4O2/c20-14-7-6-13(8-12(14)9-31-10-18(21,22)19(23,24)25)29-17(11-4-2-1-3-5-11)27-16(28-29)15(26)30/h1-8H,9-10,26H2
45 atoms
Cl 1.021183 -4.889134 1.081461
F  5.108841 0.780192 -1.660953
F  3.268877 0.42196 -2.781257
F  3.545921 1.873641 0.383882
F  1.82411 1.713642 -0.909808
F  3.520815 2.878423 -1.522987
O  2.26715 -1.025906 -0.615756
O  -6.236903 0.064341 -1.732711
N  -2.557914 -0.326431 0.064617
N  -3.724231 -0.531579 -0.548731
N  -3.444597 1.641913 -0.11468
N  -5.870882 2.254217 -1.2519
C  -1.692327 -1.421531 0.288442
C  0.517398 -2.370436 0.244029
C  -0.341346 -1.307947 0.000843
C  1.990334 -2.265667 -0.032518
C  -2.400039 0.994546 0.339834
C  -2.220639 -2.604259 0.77992
C  -0.021018 -3.546668 0.755974
C  3.622925 -0.772544 -0.782532
C  -1.278094 1.613053 1.047763
C  -1.375976 -3.674367 1.011269
C  3.784133 0.532584 -1.541621
C  -4.22384 0.673368 -0.642035
C  -0.848818 2.872495 0.637072
C  -0.661769 1.003019 2.138597
C  3.147387 1.77472 -0.884547
C  0.200632 3.498927 1.28739
C  0.388241 1.633008 2.784743
C  0.827939 2.87693 2.35609
C  -5.549236 0.943302 -1.270754
H  0.049341 -0.389665 -0.411942
H  2.54476 -2.392022 0.909531
H  2.306267 -3.086439 -0.692028
H  -3.281185 -2.689491 0.970649
H  4.152401 -0.703846 0.177104
H  4.122483 -1.554977 -1.372973
H  -1.76873 -4.605153 1.395405
H  -1.3383 3.352763 -0.199369
H  -1.00693 0.042703 2.497884
H  0.533564 4.472523 0.953635
H  0.860227 1.152061 3.630926
H  1.6521 3.363785 2.860008
H  -5.25611 2.930012 -0.833998
H  -6.746584 2.552716 -1.641149
totalener: -2061.54305224 hartree
nucrepener: 3389.54528494 hartree
electener: -5451.08833718 hartree
oneelecener: -9576.35949687 hartree
twoeener: 4125.27115968 hartree
kineticenergy: 2054.93033414 hartree
xcener: -164.591348649158 hartree
chargesum: -0.0000000
charge: -0.065164 -0.174848 -0.168197 -0.170046 -0.146833 -0.151133 -0.299720 -0.349133 0.166956 -0.276969 -0.391208 -0.245204 0.028877 0.067213 -0.160286 0.023861 0.406165 -0.135687 -0.002313 -0.053477 -0.124989 -0.104234 0.333931 0.261939 -0.140374 -0.173505 0.466776 -0.171266 -0.128373 -0.094145 0.201713 0.160142 0.089158 0.095942 0.133700 0.103177 0.099587 0.123859 0.119555 0.135928 0.126938 0.125494 0.128196 0.168564 0.159432
qa: -0.0652 -0.1748 -0.1682 -0.1700 -0.1468 -0.1511 -0.2997 -0.3491 0.1670 -0.2770 -0.3912 -0.2452 0.0289 0.0672 -0.1603 0.0239 0.4062 -0.1357 -0.0023 -0.0535 -0.1250 -0.1042 0.3339 0.2619 -0.1404 -0.1735 0.4668 -0.1713 -0.1284 -0.0941 0.2017 0.1601 0.0892 0.0959 0.1337 0.1032 0.0996 0.1239 0.1196 0.1359 0.1269 0.1255 0.1282 0.1686 0.1594
va: 1.2708 1.1360 1.1511 1.1460 1.1690 1.1704 2.0121 2.1832 3.3099 2.8951 3.0507 3.1585 3.8131 3.6266 3.9483 3.9819 3.6728 4.0671 4.0302 3.9701 3.5645 4.0172 4.2988 3.7054 3.9930 3.9339 4.3960 3.9739 3.9684 3.8947 4.4139 1.0086 0.9870 0.9904 1.0243 1.0077 1.0049 1.0123 1.0312 1.0049 1.0039 1.0031 0.9988 1.0379 1.0267
dispcorr: -0.024814380 hartree
energy: -2061.567866617459
dipole: -20.58004 22.44821 1.86817 1.63806 -1.35447 0.28358 12.84421 -11.40635 1.43787
magnitude: 2.37443 au
magnitude: 6.03532 debye
