program: Orca
programVersion: 5.0.2
elementType: Cl F F F F F O O N N N N C C C C C C C C C C C C C C C C C C C H H H H H H H H H H H H H H
charge: 0
multiplicity: 1
keywords: wb97x-d3
keywords: def2-TZVPP
keywords: def2/J RIJCOSX
keywords: DEFGRID2
keywords: scfconv7
keywords: smallprint printgap noloewdin
keywords: NOSOSCF
formula: C19H14ClF5N4O2
InChI: InChI=1/C19H14ClF5N4O2/c20-14-7-6-13(8-12(14)9-31-10-18(21,22)19(23,24)25)29-17(11-4-2-1-3-5-11)27-16(28-29)15(26)30/h1-8H,9-10,26H2
45 atoms
Cl 1.118716 -4.805087 1.484531
F  2.216471 1.669274 -0.521503
F  4.322105 1.160271 -0.301626
F  4.411288 0.373067 -2.911181
F  3.706748 2.394004 -2.651033
F  2.31552 0.82309 -3.145048
O  2.605599 -0.713212 0.709389
O  -5.66888 0.145855 -2.262181
N  -2.370676 -0.245639 0.157383
N  -3.387185 -0.441315 -0.684055
N  -3.277186 1.7089 -0.083749
N  -5.448175 2.325535 -1.659438
C  -1.51914 -1.327053 0.477907
C  0.685245 -2.191754 0.93106
C  -0.154645 -1.128708 0.627825
C  2.167951 -1.974259 1.128321
C  -2.321024 1.059439 0.53074
C  -2.069471 -2.592749 0.611448
C  0.116885 -3.452811 1.078918
C  2.806086 -0.608768 -0.667303
C  -1.382712 1.634642 1.496604
C  -1.242731 -3.658535 0.913896
C  3.186853 0.833946 -0.950666
C  -3.903863 0.753433 -0.805382
C  -1.171544 1.032422 2.734716
C  -0.709104 2.809168 1.177961
C  3.410793 1.119437 -2.446691
C  -0.280765 1.591224 3.634663
C  0.187464 3.36069 2.07907
C  0.405681 2.751618 3.305482
C  -5.099137 1.021958 -1.656746
H  0.268599 -0.141059 0.509902
H  2.402269 -2.045605 2.193528
H  2.731838 -2.774539 0.631592
H  -3.129683 -2.744577 0.467862
H  3.612677 -1.272018 -1.007923
H  1.907363 -0.865106 -1.243064
H  -1.656061 -4.651116 1.024632
H  -1.707935 0.130128 2.999245
H  -0.882725 3.281171 0.220158
H  -0.124744 1.121424 4.596345
H  0.719462 4.265997 1.820027
H  1.108407 3.182142 4.006211
H  -4.944501 2.995762 -1.105759
H  -6.252805 2.619855 -2.182552
totalener: -2061.54207700 hartree
nucrepener: 3362.44797571 hartree
electener: -5423.99005271 hartree
oneelecener: -9521.97430082 hartree
twoeener: 4097.98424811 hartree
kineticenergy: 2054.92489128 hartree
xcener: -164.590882156858 hartree
chargesum: 0.0000000
charge: -0.064730 -0.170576 -0.167879 -0.158440 -0.144437 -0.157327 -0.301282 -0.349247 0.165353 -0.276459 -0.379996 -0.244613 0.077593 0.070235 -0.239704 -0.004402 0.400342 -0.147193 -0.024524 -0.114650 -0.141500 -0.087455 0.358524 0.261181 -0.160212 -0.156253 0.440327 -0.149030 -0.152540 -0.070947 0.199386 0.177876 0.122259 0.102143 0.137091 0.130017 0.127173 0.125081 0.131693 0.121750 0.128057 0.127907 0.130068 0.169008 0.160332
qa: -0.0647 -0.1706 -0.1679 -0.1584 -0.1444 -0.1573 -0.3013 -0.3492 0.1654 -0.2765 -0.3800 -0.2446 0.0776 0.0702 -0.2397 -0.0044 0.4003 -0.1472 -0.0245 -0.1146 -0.1415 -0.0875 0.3585 0.2612 -0.1602 -0.1563 0.4403 -0.1490 -0.1525 -0.0709 0.1994 0.1779 0.1223 0.1021 0.1371 0.1300 0.1272 0.1251 0.1317 0.1218 0.1281 0.1279 0.1301 0.1690 0.1603
va: 1.2688 1.1297 1.1464 1.1577 1.1819 1.1596 1.9923 2.1829 3.3112 2.8948 3.0530 3.1595 3.7980 3.5320 3.9202 3.9547 3.6801 4.0658 4.0253 3.9425 3.5845 3.9958 4.2413 3.7022 3.9286 4.0043 4.4577 3.9883 3.9997 3.9310 4.4160 0.9921 0.9879 0.9968 1.0278 1.0125 0.9918 1.0114 1.0082 1.0254 1.0028 1.0035 0.9984 1.0376 1.0263
dispcorr: -0.024060519 hartree
energy: -2061.566137518580
dipole: -23.26853 24.40577 1.13724 3.34448 -3.10279 0.24168 18.95576 -17.61259 1.34317
magnitude: 1.77647 au
magnitude: 4.51542 debye
