program: Orca
programVersion: 5.0.2
elementType: Cl F F F F F O O N N N N C C C C C C C C C C C C C C C C C C C H H H H H H H H H H H H H H
charge: 0
multiplicity: 1
keywords: wb97x-d3
keywords: def2-TZVPP
keywords: def2/J RIJCOSX
keywords: DEFGRID2
keywords: scfconv7
keywords: smallprint printgap noloewdin
keywords: NOSOSCF
formula: C19H14ClF5N4O2
InChI: InChI=1/C19H14ClF5N4O2/c20-14-7-6-13(8-12(14)9-31-10-18(21,22)19(23,24)25)29-17(11-4-2-1-3-5-11)27-16(28-29)15(26)30/h1-8H,9-10,26H2
45 atoms
Cl 1.019697 -4.930797 -0.840061
F  3.47825 0.748425 2.611703
F  5.19147 0.906363 1.271719
F  1.838189 1.749226 0.797574
F  3.29903 1.532046 -0.781415
F  3.626733 2.936612 0.819154
O  2.294169 -1.020008 0.70738
O  -6.206456 0.087958 1.847815
N  -2.551673 -0.329488 0.014381
N  -3.707748 -0.522668 0.650597
N  -3.455177 1.635764 0.13341
N  -5.880513 2.261479 1.271833
C  -1.682767 -1.427521 -0.180827
C  0.522909 -2.38151 -0.095706
C  -0.331601 -1.306386 0.104123
C  1.994382 -2.28348 0.188918
C  -2.409953 0.981624 -0.310655
C  -2.212953 -2.624442 -0.634624
C  -0.01809 -3.57291 -0.569018
C  3.658524 -0.775843 0.814875
C  -1.306069 1.584489 -1.058903
C  -1.371741 -3.704361 -0.827799
C  3.86673 0.638919 1.326138
C  -4.218048 0.680033 0.70588
C  -0.887746 2.864694 -0.705072
C  -0.703151 0.942522 -2.138971
C  3.134724 1.737948 0.525074
C  0.135306 3.483139 -1.40332
C  0.319773 1.565202 -2.833807
C  0.74578 2.832676 -2.464769
C  -5.539465 0.957115 1.339402
H  0.060632 -0.3745 0.484222
H  2.290852 -3.074849 0.891739
H  2.553685 -2.467764 -0.740583
H  -3.273395 -2.712626 -0.824532
H  4.150966 -1.460671 1.520917
H  4.170743 -0.882103 -0.150433
H  -1.766042 -4.645963 -1.182828
H  -1.366445 3.368549 0.123663
H  -1.039317 -0.036834 -2.45266
H  0.459765 4.473673 -1.113966
H  0.780321 1.060369 -3.672295
H  1.54782 3.31428 -3.007966
H  -5.281515 2.927859 0.817428
H  -6.755638 2.563582 1.65953
totalener: -2061.54274298 hartree
nucrepener: 3397.07298121 hartree
electener: -5458.61572418 hartree
oneelecener: -9591.44563475 hartree
twoeener: 4132.82991056 hartree
kineticenergy: 2054.93135245 hartree
xcener: -164.591288756439 hartree
chargesum: 0.0000000
charge: -0.065073 -0.169420 -0.174904 -0.150135 -0.170537 -0.153911 -0.303143 -0.349126 0.168027 -0.277220 -0.391244 -0.245225 0.024770 0.068412 -0.154944 0.025340 0.407350 -0.135546 -0.002817 -0.049204 -0.123650 -0.103661 0.336030 0.261350 -0.144076 -0.176083 0.471549 -0.160890 -0.120345 -0.110094 0.201755 0.158140 0.096393 0.088192 0.132996 0.102429 0.100229 0.124131 0.119151 0.135489 0.126912 0.125274 0.129354 0.168606 0.159367
qa: -0.0651 -0.1694 -0.1749 -0.1501 -0.1705 -0.1539 -0.3031 -0.3491 0.1680 -0.2772 -0.3912 -0.2452 0.0248 0.0684 -0.1549 0.0253 0.4074 -0.1355 -0.0028 -0.0492 -0.1237 -0.1037 0.3360 0.2613 -0.1441 -0.1761 0.4715 -0.1609 -0.1203 -0.1101 0.2018 0.1581 0.0964 0.0882 0.1330 0.1024 0.1002 0.1241 0.1192 0.1355 0.1269 0.1253 0.1294 0.1686 0.1594
va: 1.2712 1.1497 1.1358 1.1670 1.1468 1.1671 2.0123 2.1832 3.3080 2.8937 3.0515 3.1587 3.8144 3.6227 3.9463 3.9790 3.6707 4.0689 4.0303 3.9641 3.5622 4.0180 4.3029 3.7062 3.9946 3.9366 4.3800 3.9726 3.9592 3.9027 4.4138 1.0111 0.9893 0.9892 1.0244 1.0052 1.0086 1.0123 1.0314 1.0055 1.0039 1.0032 0.9990 1.0378 1.0267
dispcorr: -0.025035497 hartree
energy: -2061.567778474972
dipole: -21.02983 22.84590 1.81607 1.14543 -0.94501 0.20042 -10.73515 9.34377 -1.39138
magnitude: 2.29656 au
magnitude: 5.83740 debye
