program: Orca
programVersion: 5.0.2
elementType: Cl F F F F F O O N N N N C C C C C C C C C C C C C C C C C C C H H H H H H H H H H H H H H
charge: 0
multiplicity: 1
keywords: wb97x-d3
keywords: def2-TZVPP
keywords: def2/J RIJCOSX
keywords: DEFGRID2
keywords: scfconv7
keywords: smallprint printgap noloewdin
keywords: NOSOSCF
formula: C19H14ClF5N4O2
InChI: InChI=1/C19H14ClF5N4O2/c20-14-7-6-13(8-12(14)9-31-10-18(21,22)19(23,24)25)29-17(11-4-2-1-3-5-11)27-16(28-29)15(26)30/h1-8H,9-10,26H2
45 atoms
Cl 2.169997 -3.250087 -1.691321
F  5.112033 -0.661191 1.433618
F  5.527831 1.340187 2.182769
F  3.365922 1.044423 3.93826
F  5.003257 -0.332362 4.181633
F  3.17239 -1.003385 3.277965
O  2.353215 0.315859 0.886541
O  -3.876751 2.018297 2.94801
N  -2.37692 0.28382 -0.471376
N  -2.594954 0.69642 0.777674
N  -4.18655 1.468712 -0.587853
N  -5.450289 2.752561 1.484523
C  -1.292791 -0.580621 -0.750365
C  1.045385 -1.096717 -0.504319
C  -0.042083 -0.277831 -0.234266
C  2.41669 -0.802063 0.040279
C  -3.338379 0.76775 -1.298748
C  -1.492663 -1.71474 -1.520026
C  0.837284 -2.216073 -1.306243
C  3.517855 1.054505 1.047696
C  -3.415962 0.582449 -2.748917
C  -0.413897 -2.530294 -1.808216
C  4.543879 0.433261 1.99205
C  -3.691594 1.401474 0.66689
C  -2.283957 0.613872 -3.561286
C  -4.670978 0.423447 -3.33191
C  4.00829 0.022489 3.377463
C  -2.408007 0.467242 -4.932658
C  -4.789618 0.273375 -4.703448
C  -3.658734 0.291218 -5.506667
C  -4.331361 2.080743 1.831121
H  0.07798 0.595674 0.390104
H  2.790503 -1.684841 0.570143
H  3.107006 -0.624916 -0.796841
H  -2.475199 -1.966196 -1.894155
H  4.033256 1.236497 0.092965
H  3.225393 2.025423 1.451466
H  -0.547175 -3.41657 -2.412213
H  -1.303956 0.768743 -3.130086
H  -5.550851 0.417869 -2.702673
H  -1.52393 0.497897 -5.555132
H  -5.768006 0.143537 -5.146244
H  -3.752161 0.174778 -6.578188
H  -5.758274 2.784251 0.528862
H  -5.956252 3.261771 2.186113
totalener: -2061.54229237 hartree
nucrepener: 3219.38856657 hartree
electener: -5280.93085894 hartree
oneelecener: -9236.21472331 hartree
twoeener: 3955.28386437 hartree
kineticenergy: 2054.91139519 hartree
xcener: -164.586605561606 hartree
chargesum: 0.0000000
charge: -0.062422 -0.179260 -0.173844 -0.156027 -0.149011 -0.149955 -0.317474 -0.346668 0.167959 -0.270872 -0.391224 -0.246227 0.003304 0.034130 -0.089731 0.027885 0.402545 -0.156489 0.012435 -0.052910 -0.148780 -0.098170 0.320599 0.259314 -0.171817 -0.140691 0.457231 -0.134475 -0.155269 -0.089375 0.200952 0.136158 0.105377 0.093558 0.140100 0.102225 0.119925 0.123455 0.132687 0.124048 0.128555 0.129383 0.131285 0.167747 0.159836
qa: -0.0624 -0.1793 -0.1738 -0.1560 -0.1490 -0.1500 -0.3175 -0.3467 0.1680 -0.2709 -0.3912 -0.2462 0.0033 0.0341 -0.0897 0.0279 0.4025 -0.1565 0.0124 -0.0529 -0.1488 -0.0982 0.3206 0.2593 -0.1718 -0.1407 0.4572 -0.1345 -0.1553 -0.0894 0.2010 0.1362 0.1054 0.0936 0.1401 0.1022 0.1199 0.1235 0.1327 0.1240 0.1286 0.1294 0.1313 0.1677 0.1598
va: 1.2725 1.1262 1.1394 1.1642 1.1702 1.1689 1.9955 2.1853 3.3114 2.8959 3.0505 3.1572 3.8247 3.6647 3.9929 3.9122 3.6708 4.0146 4.0315 3.9869 3.5930 4.0144 4.1716 3.7061 3.9364 4.0118 4.4333 3.9747 3.9987 3.9362 4.4142 1.0488 0.9948 0.9944 0.9970 1.0072 1.0077 1.0130 1.0077 1.0297 1.0031 1.0033 0.9988 1.0384 1.0266
dispcorr: -0.022455568 hartree
energy: -2061.564747937358
dipole: -42.02058 41.52478 -0.49580 8.06814 -8.01709 0.05105 -33.16796 30.28373 -2.88423
magnitude: 2.92698 au
magnitude: 7.43979 debye
