program: Orca
programVersion: 5.0.2
elementType: Cl F F F F F O O N N N N C C C C C C C C C C C C C C C C C C C H H H H H H H H H H H H H H
charge: 0
multiplicity: 1
keywords: wb97x-d3
keywords: def2-TZVPP
keywords: def2/J RIJCOSX
keywords: DEFGRID2
keywords: scfconv7
keywords: smallprint printgap noloewdin
keywords: NOSOSCF
formula: C19H14ClF5N4O2
InChI: InChI=1/C19H14ClF5N4O2/c20-14-7-6-13(8-12(14)9-31-10-18(21,22)19(23,24)25)29-17(11-4-2-1-3-5-11)27-16(28-29)15(26)30/h1-8H,9-10,26H2
45 atoms
Cl 2.157057 -3.303085 -1.682895
F  5.127924 -0.799983 1.494808
F  5.549417 1.171459 2.318637
F  3.35115 0.820162 4.034838
F  4.999143 -0.547295 4.260496
F  3.188762 -1.210577 3.312992
O  2.381294 0.215123 0.959428
O  -3.666278 2.28057 2.851761
N  -2.300177 0.366866 -0.52887
N  -2.474265 0.838865 0.706313
N  -4.075848 1.602118 -0.651511
N  -5.239156 3.021057 1.390843
C  -1.241893 -0.533401 -0.793112
C  1.075137 -1.122155 -0.504617
C  0.008969 -0.269732 -0.255649
C  2.442902 -0.868566 0.069374
C  -3.267508 0.846235 -1.352337
C  -1.463758 -1.66484 -1.56109
C  0.848391 -2.233174 -1.312909
C  3.548676 0.940097 1.157044
C  -3.39397 0.60357 -2.790823
C  -0.404188 -2.510964 -1.832662
C  4.561641 0.278106 2.087612
C  -3.551623 1.571992 0.592465
C  -2.289883 0.593058 -3.640781
C  -4.669019 0.431552 -3.324239
C  4.011871 -0.178756 3.453484
C  -2.461232 0.391899 -5.000138
C  -4.835029 0.226845 -4.683761
C  -3.731929 0.203008 -5.524281
C  -4.141185 2.318183 1.742236
H  0.144467 0.599117 0.37186
H  2.798243 -1.775615 0.569662
H  3.147195 -0.667034 -0.750559
H  -2.447345 -1.892744 -1.947085
H  4.073948 1.152924 0.214454
H  3.258959 1.897696 1.592963
H  -0.554638 -3.39407 -2.437279
H  -1.295182 0.756053 -3.247927
H  -5.526976 0.458297 -2.665992
H  -1.598754 0.390016 -5.652837
H  -5.828698 0.087162 -5.08759
H  -3.862248 0.044177 -6.586438
H  -5.569755 3.022767 0.442276
H  -5.713766 3.571963 2.082743
totalener: -2061.54215572 hartree
nucrepener: 3217.48305388 hartree
electener: -5279.02520960 hartree
oneelecener: -9232.44350630 hartree
twoeener: 3953.41829670 hartree
kineticenergy: 2054.91039353 hartree
xcener: -164.586557452192 hartree
chargesum: -0.0000000
charge: -0.063002 -0.179768 -0.173891 -0.155891 -0.148971 -0.150479 -0.317867 -0.346716 0.167329 -0.272238 -0.390834 -0.245745 0.007099 0.032356 -0.084656 0.027963 0.411468 -0.161930 0.008978 -0.051580 -0.162185 -0.097284 0.320435 0.260465 -0.169912 -0.137647 0.457571 -0.136662 -0.157830 -0.087309 0.200266 0.137262 0.104185 0.094223 0.141543 0.101839 0.120713 0.123241 0.133845 0.124114 0.129147 0.129454 0.131146 0.167738 0.160015
qa: -0.0630 -0.1798 -0.1739 -0.1559 -0.1490 -0.1505 -0.3179 -0.3467 0.1673 -0.2722 -0.3908 -0.2457 0.0071 0.0324 -0.0847 0.0280 0.4115 -0.1619 0.0090 -0.0516 -0.1622 -0.0973 0.3204 0.2605 -0.1699 -0.1376 0.4576 -0.1367 -0.1578 -0.0873 0.2003 0.1373 0.1042 0.0942 0.1415 0.1018 0.1207 0.1232 0.1338 0.1241 0.1291 0.1295 0.1311 0.1677 0.1600
va: 1.2715 1.1256 1.1392 1.1643 1.1702 1.1684 1.9963 2.1853 3.3139 2.8941 3.0490 3.1573 3.8300 3.6698 3.9896 3.9133 3.6596 4.0151 4.0328 3.9870 3.5944 4.0136 4.1722 3.7036 3.9334 4.0099 4.4331 3.9773 3.9994 3.9345 4.4148 1.0500 0.9954 0.9936 0.9950 1.0072 1.0075 1.0131 1.0072 1.0293 1.0031 1.0033 0.9988 1.0385 1.0264
dispcorr: -0.022415631 hartree
energy: -2061.564571348889
dipole: -41.90732 41.33650 -0.57082 9.22998 -9.21245 0.01753 -33.67185 30.81443 -2.85742
magnitude: 2.91393 au
magnitude: 7.40662 debye
