program: Orca
programVersion: 5.0.2
elementType: Cl F F F F F O O N N N N C C C C C C C C C C C C C C C C C C C H H H H H H H H H H H H H H
charge: 0
multiplicity: 1
keywords: wb97x-d3
keywords: def2-TZVPP
keywords: def2/J RIJCOSX
keywords: DEFGRID2
keywords: scfconv7
keywords: smallprint printgap noloewdin
keywords: NOSOSCF
formula: C19H14ClF5N4O2
InChI: InChI=1/C19H14ClF5N4O2/c20-14-7-6-13(8-12(14)9-31-10-18(21,22)19(23,24)25)29-17(11-4-2-1-3-5-11)27-16(28-29)15(26)30/h1-8H,9-10,26H2
45 atoms
Cl 1.225949 -4.540691 -0.547026
F  4.073535 0.71623 2.113911
F  4.368196 -0.675262 0.469075
F  3.768865 2.766319 0.381265
F  3.908724 1.427382 -1.305215
F  5.586122 1.662715 0.026318
O  1.786763 -0.725552 1.626546
O  -6.713573 1.672786 0.795747
N  -2.873833 -0.340772 -0.10941
N  -4.131101 -0.674265 0.179324
N  -3.921414 1.549519 0.13144
N  -6.788801 -0.594094 0.80397
C  -1.884078 -1.340423 -0.226177
C  0.306278 -2.162657 0.350073
C  -0.687721 -1.201453 0.458741
C  1.6181 -2.008241 1.081557
C  -2.761335 1.012853 -0.148108
C  -2.131686 -2.459664 -1.003329
C  0.039824 -3.288556 -0.424033
C  2.21197 0.265167 0.736024
C  -1.546394 1.759359 -0.482455
C  -1.163538 -3.443545 -1.092509
C  3.720566 0.454435 0.841379
C  -4.725674 0.487108 0.319287
C  -1.256255 2.916335 0.235797
C  -0.709026 1.371649 -1.526639
C  4.264436 1.600296 -0.030149
C  -0.129218 3.661795 -0.070951
C  0.411178 2.125922 -1.836061
C  0.708241 3.267446 -1.104511
C  -6.174329 0.601699 0.664243
H  -0.529994 -0.342692 1.096498
H  1.652703 -2.707498 1.920805
H  2.442038 -2.284338 0.416665
H  -3.072162 -2.565309 -1.525593
H  1.940296 0.047477 -0.302383
H  1.715955 1.202397 1.002221
H  -1.339816 -4.328911 -1.68704
H  -1.923127 3.22865 1.028264
H  -0.940745 0.494239 -2.116455
H  0.091352 4.556953 0.494814
H  1.047826 1.828768 -2.658742
H  1.58177 3.856015 -1.349815
H  -6.282192 -1.456736 0.72085
H  -7.758391 -0.617693 1.062996
totalener: -2061.54126962 hartree
nucrepener: 3368.58576337 hartree
electener: -5430.12703299 hartree
oneelecener: -9533.57476675 hartree
twoeener: 4103.44773376 hartree
kineticenergy: 2054.92922023 hartree
xcener: -164.592032185526 hartree
chargesum: -0.0000000
charge: -0.057587 -0.167691 -0.183974 -0.160014 -0.166236 -0.142937 -0.325352 -0.339420 0.136837 -0.329110 -0.297724 -0.245396 0.043937 0.028640 -0.161107 0.026132 0.400173 -0.161891 -0.007354 -0.073740 -0.126837 -0.088366 0.363633 0.248395 -0.121262 -0.162432 0.447971 -0.155767 -0.190063 -0.101984 0.197180 0.149865 0.121513 0.111690 0.130074 0.109750 0.127574 0.125333 0.133834 0.133360 0.132063 0.137670 0.136746 0.164263 0.159608
qa: -0.0576 -0.1677 -0.1840 -0.1600 -0.1662 -0.1429 -0.3254 -0.3394 0.1368 -0.3291 -0.2977 -0.2454 0.0439 0.0286 -0.1611 0.0261 0.4002 -0.1619 -0.0074 -0.0737 -0.1268 -0.0884 0.3636 0.2484 -0.1213 -0.1624 0.4480 -0.1558 -0.1901 -0.1020 0.1972 0.1499 0.1215 0.1117 0.1301 0.1098 0.1276 0.1253 0.1338 0.1334 0.1321 0.1377 0.1367 0.1643 0.1596
va: 1.2765 1.1485 1.1219 1.1522 1.1440 1.1851 2.0041 2.1919 3.3649 2.8836 3.1203 3.1602 3.7777 3.5683 3.9214 3.8918 3.6775 4.0726 4.0333 3.9654 3.5158 3.9923 4.2781 3.7611 4.0040 3.8769 4.4509 3.9696 3.9151 3.8537 4.4076 1.0176 0.9906 1.0026 1.0226 1.0080 1.0091 1.0114 1.0255 1.0077 1.0039 1.0061 1.0055 1.0353 1.0274
dispcorr: -0.026580432 hartree
energy: -2061.567850050601
dipole: -32.57648 33.31197 0.73549 1.34619 -2.83964 -1.49345 -2.94774 2.22113 -0.72661
magnitude: 1.81639 au
magnitude: 4.61691 debye
