program: Gaussian 09
title: 000055375
version: EM64L-G09RevD.01
frameworkgroup: C1[X(C22H25N2OP)]
method: RPBEPBE
basis: SDD
operation: Freq
keyword: #p
keyword: freq=noraman
keyword: PBEPBE/SDD
title: #p freq=noraman PBEPBE/SDD
converged: YES YES NO NO
title: Mulliken charges:
elementType: P O N N C C C C C C C C C C C C C C C C C C C C C C H H H H H H H H H H H H H H H H H H H H H H H H H
charge: 0.963949 -0.678462 -0.413599 -0.417269 -0.647251 -0.639196 -0.099640 -0.271115 -0.307267 0.460443 0.462535 -0.226835 -0.204740 -0.220858 -0.359008 -0.355178 -0.418582 -0.421251 0.445552 0.446421 -0.428612 -0.429092 -0.335546 -0.336024 -0.811825 -0.813382 0.238928 0.265484 0.260493 0.245636 0.333517 0.342153 0.233509 0.294513 0.236610 0.239070 0.236852 0.222989 0.224187 0.224624 0.222526 0.222602 0.221139 0.224954 0.222947 0.226169 0.220544 0.226286 0.224993 0.225002 0.220104
chargesum: 0.00000
title: Mulliken charges with hydrogens summed into heavy atoms:
elementType: P O N N C C C C C C C C C C C C C C C C C C C C C C
charge: 0.963949 -0.678462 -0.080081 -0.075117 -0.142838 -0.133067 -0.099640 -0.037606 -0.012753 0.460443 0.462535 0.009774 0.034330 0.015994 -0.136019 -0.130991 -0.193958 -0.198725 0.445552 0.446421 -0.206009 -0.207953 -0.110591 -0.113077 -0.138826 -0.143283
polarizability: 3.32889495e+02 1.43668040e+01 2.99320816e+02 1.64638192e+01 -8.72157653e+00 2.45899355e+02
1716.lowfreq: -5.5576 -0.0004 0.0007 0.0008 0.5702 5.7071 6.8050 16.4238 26.3522
frequency: 6.3063 16.4006 26.2528 29.9034 32.5301 34.8839 41.3451 53.3165 58.6769 68.8375 89.0245 121.3378 136.0222 141.0243 154.7895 161.4376 167.0334 199.2232 211.4586 231.0568 304.1800 317.2170 322.7927 324.4176 342.1554 361.7004 397.0249 409.3981 410.9762 412.2289 450.2517 463.7495 487.3105 506.2731 507.6536 513.2288 531.9109 565.0507 585.5907 610.8828 637.8425 638.8567 667.8855 700.9444 702.9391 709.9611 711.2265 717.8864 755.1394 758.7914 768.2110 805.6731 806.5378 817.9340 818.7063 832.2109 836.7016 863.0196 885.3961 916.4358 926.7330 928.8163 936.6319 954.6566 955.2836 966.8975 982.5106 985.6543 987.8243 988.7449 1002.5814 1003.6248 1009.9319 1020.7718 1044.9837 1045.5313 1079.7229 1094.0033 1110.9115 1112.9121 1130.0298 1133.5084 1169.2442 1174.2175 1176.1723 1188.9292 1192.2924 1192.8057 1224.3194 1224.3780 1242.3319 1246.2311 1304.4626 1306.3492 1311.4422 1322.5463 1328.8988 1367.8801 1368.8875 1380.6219 1397.1567 1399.5298 1419.4674 1420.6464 1427.1867 1455.4576 1461.3573 1466.8428 1470.0701 1471.1482 1472.4544 1473.6047 1491.7567 1495.7156 1523.8708 1530.1854 1585.5102 1587.2290 1589.4644 1597.2637 1636.6034 1638.8457 2917.7034 2927.9247 2968.0471 2969.9548 2995.0103 3000.4633 3042.8670 3045.2036 3075.6684 3077.4888 3108.3663 3110.1102 3113.8716 3114.4778 3115.7681 3132.8990 3133.2052 3134.1742 3141.9792 3145.6739 3145.7440 3154.3183 3168.7853 3440.0414 3467.6718
redmass: 5.0500 3.8231 1.6577 1.9134 3.8334 3.8286 4.1328 1.7020 2.2958 2.8368 4.3395 4.1625 3.7813 5.3146 3.7866 4.0509 3.9305 4.0358 4.4102 3.6637 3.9245 2.9965 3.8890 3.8050 3.8788 5.6051 2.8100 3.5508 3.0338 3.8417 4.2179 4.4755 3.9477 2.5419 2.3864 4.8066 4.6794 1.1468 1.1777 6.4361 6.8526 6.8087 4.9698 4.7624 2.4198 2.7098 2.8273 3.2099 2.3972 3.7690 2.3721 1.5174 1.5102 1.4492 1.4306 3.8217 4.5692 1.2474 1.9062 1.4594 1.3313 1.3475 1.3790 1.3561 1.3588 4.7474 1.4589 1.4730 5.6617 1.4017 2.6820 2.6305 1.3260 2.8122 1.5111 1.5148 1.6261 2.8999 2.7919 2.5202 1.5563 1.7680 1.1368 1.1118 1.0577 1.1241 1.1102 1.1121 2.6867 2.6799 1.3386 1.3694 1.3914 1.3450 1.3208 1.9930 2.0978 4.2540 4.2480 8.6936 1.2371 1.2358 3.6029 3.6522 2.1099 1.1136 1.1378 2.0286 1.0492 1.0464 1.1551 1.1402 1.3555 1.4472 3.0629 2.9540 4.6943 4.9027 5.5909 5.8283 6.5106 6.5446 1.0626 1.0622 1.0372 1.0372 1.0957 1.0966 1.0978 1.0978 1.0981 1.0982 1.0868 1.0868 1.0887 1.0878 1.0877 1.0866 1.0964 1.0965 1.0913 1.0951 1.0953 1.0960 1.1015 1.0775 1.0771
irintensity: 0.1834 0.3165 0.0427 0.9796 1.4715 0.4118 0.0883 0.2863 1.0825 0.4067 9.1262 1.0220 10.8652 2.4778 0.1961 5.3811 5.1291 1.4949 6.2223 2.1418 5.0922 2.1561 2.8180 4.0065 1.6595 32.9891 0.0827 13.7963 1.3143 16.4815 1.6629 11.0977 17.3033 9.0450 21.7868 33.6693 59.9902 141.3670 174.3924 0.1090 0.0642 0.1579 1.6286 20.9074 10.3856 11.2262 3.8106 100.5434 42.1335 4.0398 4.5433 47.2377 62.3372 24.4771 29.3278 13.8750 15.2975 0.2592 18.3377 38.1671 1.2727 4.3580 0.6747 0.7420 0.8088 43.0887 7.1662 6.5313 2.9319 0.2327 1.8754 2.8296 0.1085 1.9797 9.8522 10.0890 3.5685 46.1423 0.6349 2.6116 10.4328 20.5906 25.0843 17.9530 0.8331 3.0538 11.2154 21.3161 1.6833 1.6214 17.5235 26.3541 1.7905 0.4054 4.8701 75.5699 42.8589 54.0613 35.4512 1.7203 5.4952 6.6125 3.8575 2.9231 18.6357 19.9181 17.1619 9.4610 11.8853 13.2366 73.4531 31.0820 79.7782 12.6517 575.6159 268.7022 5.3327 6.0933 3.5482 0.1850 202.8119 98.2116 96.5462 81.1603 71.0964 65.2820 33.2558 24.3895 27.0227 26.3017 21.1893 20.8322 16.9900 15.3053 9.1029 34.3880 34.9988 1.8125 29.4974 33.0567 4.4270 12.8242 15.5617 16.9901 32.0194 182.5503 118.9923
temp: 298.150 k
press: 1.00000 atm
elementType: 15 8 7 7 6 6 6 6 6 6 6 6 6 6 6 6 6 6 6 6 6 6 6 6 6 6 1 1 1 1 1 1 1 1 1 1 1 1 1 1 1 1 1 1 1 1 1 1 1 1 1
symmnumber: 1
zpe: 1088244.1 jmol-1
zpe.correction: 0.414490 hartree
zpe.thermalcorrener: 0.440822 hartree
zpe.thermalcorrenthalpy: 0.441766 hartree
zpe.thermalcorrgfe: 0.351739 hartree
zpe.sumelectzpe: -1377.409047 hartree
zpe.sumelectthermal: -1377.382715 hartree
zpe.sumelectthermalent: -1377.381771 hartree
zpe.sumelectthermalfe: -1377.471799 hartree
dipole: -0.1568 3.2759 -3.1176
dipole: 4.5250
quadrupole: -165.8476 -145.5892 -155.2390
quadrupole: 5.6978 3.1669 -7.1628
quadrupole: -10.2890 9.9694 0.3196 5.6978 3.1669 -7.1628
hfenergy: -1377.8235375 hartree
pointgroup: C01 [X(C22H25N2O1P1)]
dipole: -0.1836319 0.7775438 -1.5909192 debye
polarizability: 328.045061|23.6635971|292.7133965|12.1897572|-22.808606|257.3512083 unknown
InChI: InChI=1S/C22H25N2OP/c1-18-8-12-20(13-9-18)23-16-26(25,22-6-4-3-5-7-22)17-24-21-14-10-19(2)11-15-21/h3-15,23-24H,16-17H2,1-2H3
charge 0 multiplicity 1
51 atoms
P  -0.180155 1.430037 -0.025655
O  -0.124652 1.730657 1.574857
N  -2.385167 0.025063 0.590465
N  2.032145 0.04523 0.612042
C  -1.900829 0.806144 -0.530029
C  1.040671 0.029917 -0.444252
C  0.205886 2.922705 -1.067456
C  0.249347 2.859458 -2.480079
C  0.454795 4.137742 -0.388992
C  -3.498019 -0.828711 0.514162
C  3.206158 -0.71754 0.576179
C  0.543493 4.026843 -3.219939
C  0.750434 5.301101 -1.134698
C  0.794494 5.246174 -2.547329
C  -4.231131 -1.017856 -0.689742
C  3.525207 -1.568685 -0.518781
C  -3.91245 -1.544133 1.676345
C  4.126608 -0.64569 1.664321
C  -5.746401 -2.62468 0.423025
C  5.650585 -2.240906 0.552008
C  -5.329339 -1.907156 -0.723014
C  4.729764 -2.307674 -0.520462
C  -5.013212 -2.416882 1.623805
C  5.316109 -1.394445 1.644959
C  -6.930239 -3.576634 0.38285
C  6.944352 -3.038385 0.545639
H  -1.794379 0.18826 -1.443794
H  -2.523193 1.69239 -0.784864
H  0.455292 -0.915377 -0.504021
H  1.486141 0.232931 -1.438802
H  -2.033947 0.306932 1.513254
H  1.751183 0.516434 1.481834
H  0.059543 1.916747 -3.009465
H  0.416882 4.153408 0.706391
H  0.579589 3.98562 -4.313794
H  0.947706 6.245193 -0.615806
H  1.025491 6.14911 -3.123251
H  -3.962894 -0.466686 -1.597541
H  2.835438 -1.668185 -1.363859
H  -3.359537 -1.413183 2.614949
H  3.900206 0.004715 2.518453
H  -5.877461 -2.035881 -1.664877
H  4.951224 -2.956433 -1.377432
H  -5.309312 -2.953878 2.534081
H  6.004671 -1.319231 2.496576
H  -7.720975 -3.273536 1.095606
H  -7.384051 -3.611223 -0.623038
H  -6.63169 -4.608511 0.650074
H  7.831117 -2.376547 0.582977
H  7.009462 -3.716399 1.41815
H  7.029841 -3.657664 -0.364528
