program: Gaussian 09
title: 000053533
version: EM64L-G09RevD.01
frameworkgroup: C1[X(C18H15NO6)]
method: RPBEPBE
basis: SDD
operation: Freq
keyword: #p
keyword: freq=noraman
keyword: PBEPBE/SDD
title: #p freq=noraman PBEPBE/SDD
converged: YES YES NO NO
title: Mulliken charges:
elementType: O O O O O O N C C C C C C C C C C C C C C C C C C H H H H H H H H H H H H H H H
charge: -0.239752 -0.193040 -0.233821 -0.406175 -0.232974 -0.257099 -0.251610 0.292214 -0.402188 0.173945 -0.336800 0.344068 -0.475293 0.174511 -0.480177 -0.373993 -0.001208 0.294030 0.199766 -0.362500 -0.335907 -0.358727 -0.364746 0.323858 -0.536516 0.257234 0.273616 0.250460 0.297927 0.268532 0.286947 0.276364 0.272010 0.265961 0.246216 0.257088 0.384097 0.227067 0.226376 0.250236
chargesum: 0.00000
title: Mulliken charges with hydrogens summed into heavy atoms:
elementType: O O O O O O N C C C C C C C C C C C C C C C C C C
charge: -0.239752 -0.193040 -0.233821 -0.022077 -0.232974 -0.257099 -0.251610 0.292214 0.128663 0.173945 -0.086340 0.344068 -0.177366 0.174511 0.075302 -0.097629 -0.001208 0.294030 0.199766 -0.090490 -0.069946 -0.112511 -0.107658 0.323858 0.167163
polarizability: 3.89335590e+02 5.15643731e-01 2.11337101e+02 9.85345909e+00 -1.43216699e+01 1.34967978e+02
1716.lowfreq: -13.2830 -4.8553 -4.4449 -0.0006 0.0008 0.0010 9.8171 13.7034 18.4964
frequency: 7.7656 13.4914 18.4858 32.6298 53.4789 59.4136 65.1104 82.9667 105.2176 137.6056 145.3543 157.6570 163.9457 183.6128 215.1056 245.3300 261.2279 287.2015 294.2570 302.3289 327.4593 343.1446 373.2407 417.0716 430.8270 447.1386 457.5622 496.3253 508.9036 529.1566 536.5838 555.3049 583.6652 590.1704 605.5055 627.4215 644.1319 657.7109 681.5612 685.3459 699.0221 730.2986 738.0980 767.5281 772.2925 776.6343 826.6493 832.1065 850.5859 857.5806 879.2312 891.8823 906.4985 944.9894 964.6671 970.7980 980.1019 982.3684 982.6725 1001.7776 1028.4443 1062.2207 1083.5235 1096.4652 1110.5757 1116.0911 1131.6178 1156.1115 1160.4735 1176.7090 1201.1229 1230.5519 1240.9275 1247.6823 1273.6255 1294.5182 1305.7292 1308.5096 1337.0462 1356.4126 1369.5471 1384.8149 1395.1597 1426.8888 1435.8170 1443.4751 1448.1240 1464.8913 1467.8483 1470.5449 1488.0565 1498.3974 1526.5177 1572.3153 1604.0537 1616.1601 1628.7530 1661.8337 1735.6305 2967.8243 3005.3491 3038.2099 3059.6369 3067.5416 3104.6475 3132.4417 3147.4582 3148.9685 3152.1147 3168.6540 3171.5644 3173.0432 3181.7270 3513.7259
redmass: 6.2070 7.3770 12.7454 4.9436 5.0325 4.3174 2.7601 4.3541 6.5580 6.4706 5.4592 5.8481 5.8953 5.1217 1.2610 3.4531 4.0342 4.5866 5.3911 5.6971 10.4607 6.6199 7.7741 3.0391 3.3891 4.3156 4.8187 3.8493 1.9280 4.3158 6.5747 4.6891 6.0911 4.9414 5.4815 7.0229 1.3516 5.7994 10.3409 8.1542 3.9794 5.9371 4.8736 3.4086 4.6364 1.6313 1.2958 1.4472 2.2032 4.3398 4.7812 3.9474 1.4864 3.9634 1.3760 1.4230 1.7627 2.9234 4.0432 2.5464 3.6696 3.5221 2.5065 2.0740 1.2591 1.3411 1.9860 1.3338 1.4201 1.2421 2.2018 1.6688 3.2217 1.4865 1.6499 2.2007 1.5075 1.5562 1.8217 4.2024 5.1555 2.1290 2.4786 3.8730 1.2190 1.0994 4.7477 1.1166 1.0504 1.0728 3.4704 2.5973 11.1658 7.2927 8.1696 6.4032 8.2178 8.3692 12.1663 1.0326 1.0635 1.0603 1.1044 1.0977 1.1051 1.1000 1.0883 1.0878 1.0889 1.0956 1.0963 1.0967 1.0934 1.0640
irintensity: 0.2194 1.1162 0.8294 2.3872 0.8519 2.5878 0.5838 1.5755 6.7504 2.3543 5.9108 2.4245 1.2940 1.2765 0.9512 0.1596 1.4709 7.2827 0.4443 3.8967 2.2448 1.6994 3.3671 2.7510 15.0816 6.9030 9.3901 1.0602 35.1746 5.6702 56.8596 37.7874 16.9240 31.1965 3.1060 2.4260 121.6890 20.5071 11.5964 5.9879 17.7075 19.1953 1.7917 53.6401 1.7940 37.2073 10.4365 12.4519 93.0355 101.0163 12.6072 5.7945 14.2390 10.8984 2.8523 9.1566 6.0577 41.7619 24.1713 3.9153 140.7281 58.7673 97.7246 56.8590 0.1718 11.8542 13.2382 10.7878 31.2661 227.9538 47.5294 17.8717 233.8776 6.3845 135.0253 352.0296 135.1240 96.4045 16.5598 183.5140 66.0174 45.0983 5.5245 0.1613 7.2171 18.6893 67.4904 37.3213 15.3191 53.1083 97.3719 30.9859 148.5266 43.9216 46.2659 324.0925 11.4956 221.0209 737.4451 76.3655 4.1444 10.4861 41.7488 0.8981 3.4486 23.0518 7.7888 2.1024 4.9044 15.2751 6.0898 4.5659 0.3977 29.7255
temp: 298.150 k
press: 1.00000 atm
elementType: 8 8 8 8 8 8 7 6 6 6 6 6 6 6 6 6 6 6 6 6 6 6 6 6 6 1 1 1 1 1 1 1 1 1 1 1 1 1 1 1
symmnumber: 1
zpe: 779225.3 jmol-1
zpe.correction: 0.296791 hartree
zpe.thermalcorrener: 0.319235 hartree
zpe.thermalcorrenthalpy: 0.320179 hartree
zpe.thermalcorrgfe: 0.240007 hartree
zpe.sumelectzpe: -1199.251399 hartree
zpe.sumelectthermal: -1199.228956 hartree
zpe.sumelectthermalent: -1199.228011 hartree
zpe.sumelectthermalfe: -1199.308183 hartree
dipole: 2.2783 1.0816 2.6205
dipole: 3.6370
quadrupole: -95.8615 -166.8222 -145.7551
quadrupole: -15.6333 -16.4343 -0.7054
quadrupole: 40.2848 -30.6760 -9.6088 -15.6333 -16.4343 -0.7054
hfenergy: -1199.5481902 hartree
pointgroup: C01 [X(C18H15N1O6)]
dipole: -0.9534306 -0.6647538 0.8345957 debye
polarizability: 389.6390078|-3.4606183|198.209539|2.4777629|32.2687254|147.7921222 unknown
InChI: InChI=1S/C18H15NO6/c1-24-13-5-2-11(3-6-13)17(22)12-4-7-14-15(10-12)25-18(23)19(14)9-8-16(20)21/h2-7,10,20H,8-9H2,1H3
charge 0 multiplicity 1
40 atoms
O  1.571622 2.270814 -0.496347
O  3.788344 3.104358 -0.266349
O  -2.105361 -2.429455 -1.721012
O  6.839543 -0.911486 2.454335
O  7.0474 -1.244493 0.163936
O  -6.581527 1.278627 1.045877
N  3.302154 0.770845 -0.476783
C  2.116633 0.022908 -0.60299
C  4.672358 0.251834 -0.385014
C  1.050153 0.957795 -0.615211
C  1.863767 -1.355918 -0.731058
C  -0.555827 -0.812165 -0.857436
C  -0.285819 0.583958 -0.735936
C  3.012531 2.146963 -0.396696
C  5.04861 -0.105183 1.070322
C  0.515763 -1.751141 -0.86678
C  -1.948091 -1.345139 -1.069394
C  -3.135593 -0.614839 -0.527477
C  6.394211 -0.800795 1.134278
C  -4.391945 -0.823335 -1.155861
C  -3.087342 0.213526 0.632032
C  -5.563247 -0.209464 -0.677351
C  -4.249951 0.819399 1.132698
C  -5.491702 0.619967 0.474256
C  -7.898548 1.10146 0.421982
H  4.772306 -0.630464 -1.039212
H  5.352846 1.029559 -0.77001
H  2.670724 -2.094719 -0.735045
H  -1.08182 1.331095 -0.773814
H  4.293838 -0.779837 1.519009
H  5.077944 0.797572 1.705562
H  0.259339 -2.806991 -0.997161
H  -4.427897 -1.483763 -2.02863
H  -2.142812 0.353302 1.167315
H  -6.512554 -0.379455 -1.193607
H  -4.22816 1.443415 2.030903
H  7.716881 -1.382743 2.47283
H  -8.211719 0.040244 0.443425
H  -7.900265 1.471969 -0.62084
H  -8.585585 1.704773 1.032351
