program: Gaussian 09
title: 000055233
version: EM64L-G09RevD.01
frameworkgroup: C1[X(C20H24N2O2)]
method: RPBEPBE
basis: SDD
operation: Freq
keyword: #p
keyword: freq=noraman
keyword: PBEPBE/SDD
title: #p freq=noraman PBEPBE/SDD
converged: YES YES NO NO
title: Mulliken charges:
elementType: O O N N C C C C C C C C C C C C C C C C C C C C H H H H H H H H H H H H H H H H H H H H H H H H
charge: -0.262520 -0.205766 -0.070724 -0.175768 -0.361609 -0.363140 -0.386126 -0.411969 -0.329336 -0.430929 0.469694 -0.309954 -0.377389 -0.381436 -0.234515 -0.225796 -0.268057 0.390783 -0.510084 -0.351358 0.408724 -0.208386 -0.396040 -0.199192 0.208107 0.187082 0.185323 0.214649 0.216694 0.205695 0.211382 0.217386 0.202016 0.173516 0.226755 0.236810 0.209282 0.204550 0.232569 0.215543 0.218604 0.218613 0.225580 0.292293 0.255079 0.230117 0.236716 0.166530
chargesum: 0.00000
title: Mulliken charges with hydrogens summed into heavy atoms:
elementType: O O N N C C C C C C C C C C C C C C C C C C C C
charge: -0.262520 -0.205766 -0.070724 -0.175768 0.033580 0.036832 0.036263 0.016799 0.046195 0.032637 0.469694 0.103877 -0.144820 -0.165893 -0.015910 -0.007183 -0.042476 0.390783 -0.217791 -0.096278 0.408724 0.021731 -0.159324 -0.032661
polarizability: 3.69250496e+02 -2.85930588e-01 2.43482060e+02 -1.41885156e+00 5.52345402e+00 1.24837098e+02
1716.lowfreq: -12.3184 -0.0005 -0.0004 0.0015 1.3100 3.9165 11.0896 17.8767 22.9841
frequency: 10.4323 17.6364 22.4730 36.8573 55.4373 66.6213 87.4754 108.3836 114.9391 123.9477 142.0243 145.2404 181.6454 205.0045 215.6561 238.3914 252.9116 256.9191 287.8711 299.3915 316.5715 387.8803 408.4825 420.8928 431.6021 446.3677 447.2410 454.4214 478.9808 516.3515 545.5003 561.6400 593.6965 614.5051 624.5677 634.4877 688.0265 690.7882 719.4386 745.9484 756.7328 773.1376 779.2535 790.0843 815.6189 843.3574 874.1388 880.3144 893.7811 906.1640 917.7453 921.2279 955.0405 956.5172 975.2077 976.4177 978.2616 978.4275 995.4223 999.2810 1013.7649 1032.5135 1050.6903 1059.8165 1070.1195 1081.3623 1087.2255 1090.0981 1098.1855 1119.9959 1138.8085 1144.8217 1153.6772 1171.0574 1177.8755 1186.8014 1199.9169 1200.1276 1213.8339 1237.3467 1244.0976 1263.2413 1279.9654 1284.3711 1287.3309 1290.4564 1306.4068 1326.5128 1342.0736 1346.3348 1358.5050 1367.8236 1374.2849 1378.7540 1380.0268 1384.7165 1400.0171 1404.1962 1446.3000 1449.2081 1453.2261 1457.5970 1462.8978 1466.5574 1467.6658 1471.7146 1479.4788 1491.9873 1495.5816 1579.3818 1581.3115 1603.8057 1618.1423 1627.0212 2825.3583 2848.0279 2861.2921 2869.4649 2909.8957 2919.6760 2944.6238 2994.9421 3003.5506 3013.2500 3029.5882 3052.6775 3056.4867 3081.9217 3091.7028 3121.0843 3127.7240 3128.6180 3148.4793 3148.8952 3157.4849 3164.2068 3168.9304 3170.1780
redmass: 4.6940 4.0864 5.7420 5.4894 3.3846 4.2861 4.7901 2.3701 4.1589 5.8800 4.0805 2.8701 2.6217 4.2984 3.7747 2.7276 2.5262 3.0375 3.6574 2.5938 4.4246 2.0010 2.8992 4.0167 6.1531 2.8320 3.5928 4.3147 2.8832 2.9047 4.7277 4.1555 6.0184 6.1691 2.3630 6.7552 2.0470 1.8022 3.9115 5.9331 1.8838 3.4490 1.1787 1.4098 1.2908 1.5569 1.4934 1.2849 1.3316 4.6252 1.4301 3.8232 2.1559 1.3925 1.3509 1.3178 5.1414 5.4206 1.8423 2.8647 3.0068 2.1591 1.8736 2.4764 2.2915 2.6638 2.1370 1.7369 1.7845 1.9517 2.4016 2.0281 2.8624 1.0854 1.5648 1.1861 1.1594 1.1339 1.8197 1.4797 3.4388 1.2778 1.2292 1.3881 1.2985 1.1835 1.4047 1.3796 1.3662 1.3528 1.7555 1.4730 1.6598 1.4297 1.6796 3.4554 1.5620 2.9760 2.3867 2.7587 1.0863 1.1180 1.1085 2.2994 1.0971 1.1099 1.1249 1.1092 2.3974 5.9690 6.2312 6.8884 6.0771 6.8187 1.0707 1.0712 1.0694 1.0849 1.0691 1.0710 1.0551 1.0861 1.1063 1.0606 1.0892 1.0904 1.0887 1.1043 1.0890 1.0843 1.0883 1.0870 1.0922 1.0925 1.0941 1.0920 1.0997 1.0967
irintensity: 1.1434 0.1592 0.5909 0.3389 1.9918 0.8731 0.7800 1.6077 0.1926 1.8161 3.7368 5.4312 8.7177 3.1989 0.4154 1.5825 0.3894 6.4553 2.9552 16.5307 1.1161 1.2556 0.6458 0.6340 0.0673 7.3750 6.2318 3.1826 1.4137 15.5753 0.8982 0.0035 5.9515 0.5175 4.1438 20.7415 25.2682 42.6108 5.0725 62.7670 77.0008 6.0940 27.3759 38.2520 0.7821 0.3226 4.7853 0.6153 0.9839 25.7120 14.4651 52.4925 7.9091 0.3991 0.1361 0.4375 1.8653 13.7298 12.1696 116.2465 14.1371 15.5708 0.4939 9.3740 4.6174 4.5155 4.1461 4.1093 8.1446 19.9828 96.7166 17.0366 30.5362 0.1682 5.8377 2.4333 1.2329 0.8019 1.0618 226.8438 304.0486 30.8884 2.2695 61.4011 2.3435 11.5021 27.5304 4.6053 2.6856 6.7931 21.6133 5.4675 15.3532 20.6131 49.1875 29.5425 4.9488 10.8028 1.2664 139.7811 4.0726 9.2089 45.7248 29.4890 18.2212 10.4852 2.7114 10.5839 134.3805 10.7670 93.1848 98.7418 173.0789 127.2429 71.5625 51.4683 134.6349 142.4083 52.7060 106.2091 34.4478 19.0326 30.3068 19.6998 53.1728 39.7240 26.0997 37.0239 20.4050 9.9906 8.5181 2.1599 41.1753 21.9795 41.7990 1.7258 6.7763 15.7078
temp: 298.150 k
press: 1.00000 atm
elementType: 8 8 7 7 6 6 6 6 6 6 6 6 6 6 6 6 6 6 6 6 6 6 6 6 1 1 1 1 1 1 1 1 1 1 1 1 1 1 1 1 1 1 1 1 1 1 1 1
symmnumber: 1
zpe: 1047329.8 jmol-1
zpe.correction: 0.398907 hartree
zpe.thermalcorrener: 0.421231 hartree
zpe.thermalcorrenthalpy: 0.422176 hartree
zpe.thermalcorrgfe: 0.343483 hartree
zpe.sumelectzpe: -1034.664076 hartree
zpe.sumelectthermal: -1034.641752 hartree
zpe.sumelectthermalent: -1034.640807 hartree
zpe.sumelectthermalfe: -1034.719500 hartree
dipole: 0.2128 -5.5733 -0.8456
dipole: 5.6411
quadrupole: -160.3854 -140.9168 -149.6294
quadrupole: 28.3393 5.9814 -1.6505
quadrupole: -10.0749 9.3937 0.6811 28.3393 5.9814 -1.6505
hfenergy: -1035.062983 hartree
pointgroup: C01 [X(C20H24N2O2)]
dipole: 0.0719612 -2.2180643 -0.0250505 debye
polarizability: 369.2440895|-1.1428007|242.7232147|-1.2147109|-10.9927346|125.6023503 unknown
InChI: InChI=1S/C20H24N2O2/c23-17-18-6-4-9-20(16-18)24-15-5-10-21-11-13-22(14-12-21)19-7-2-1-3-8-19/h1-4,6-9,16-17H,5,10-15H2
charge 0 multiplicity 1
48 atoms
O  -3.416688 0.134752 0.105936
O  -7.721578 2.963769 -0.129271
N  1.427997 -0.748093 0.404831
N  4.243666 -0.145176 0.011647
C  2.461376 -1.807483 0.517375
C  1.866623 0.261836 -0.589164
C  3.805038 -1.202169 0.952446
C  3.213542 0.891192 -0.188221
C  0.091682 -1.319186 0.109742
C  -1.04421 -0.279864 0.221662
C  5.616549 0.208861 -0.059603
C  -2.417508 -0.950375 0.142408
C  6.035055 1.560974 -0.253207
C  6.634413 -0.791842 0.019269
C  7.403109 1.886624 -0.375401
C  7.996381 -0.452557 -0.093222
C  8.399513 0.889186 -0.295032
C  -4.770196 -0.21422 0.024464
C  -5.677049 0.867643 -0.020213
C  -5.253464 -1.551208 -0.014128
C  -7.066351 0.615861 -0.104008
C  -6.644928 -1.791212 -0.097421
C  -7.556704 -0.718581 -0.14281
C  -8.03324 1.743557 -0.154022
H  2.134645 -2.542355 1.276962
H  2.602123 -2.347972 -0.453863
H  1.969446 -0.195157 -1.60754
H  1.114904 1.067565 -0.650481
H  3.689785 -0.779884 1.97718
H  4.559324 -2.002157 1.001033
H  3.069124 1.503819 0.732144
H  3.529109 1.563046 -1.004776
H  -0.08478 -2.129173 0.846045
H  0.061199 -1.793197 -0.907985
H  -0.982895 0.465803 -0.591572
H  -0.946978 0.262543 1.179021
H  -2.601241 -1.596106 1.026547
H  -2.507898 -1.568543 -0.776373
H  5.300396 2.370501 -0.285721
H  6.363527 -1.84576 0.138818
H  7.688608 2.935244 -0.520869
H  8.749337 -1.247475 -0.034923
H  9.459695 1.147222 -0.385093
H  -5.310776 1.898716 0.008747
H  -4.564133 -2.399801 0.020462
H  -7.007878 -2.824238 -0.126053
H  -8.6355 -0.903122 -0.20767
H  -9.107069 1.430591 -0.218596
