program: Gaussian 09
title: 000006345
version: EM64L-G09RevD.01
frameworkgroup: CS[SG(CH2),X(F2)]
method: RPBEPBE
basis: SDD
operation: Freq
keyword: #p
keyword: freq=noraman
keyword: PBEPBE/SDD
title: #p freq=noraman PBEPBE/SDD
converged: YES YES YES YES
title: Mulliken charges:
elementType: F F C H H
charge: -0.219440 -0.219440 0.012484 0.213194 0.213203
chargesum: 0.00000
title: Mulliken charges with hydrogens summed into heavy atoms:
elementType: F F C
charge: -0.219440 -0.219440 0.438880
polarizability: 1.09164071e+01 3.80063466e-03 1.20946886e+01 -6.87406268e-10 9.35737373e-09 1.46233194e+01
1716.lowfreq: -25.7508 -19.0128 -13.7756 0.0015 0.0017 0.0018 449.9062 970.6251 989.4739
frequency: 449.9062 970.6251 989.4739 1096.5899 1167.2600 1388.2793 1455.4119 3025.8626 3123.1705
redmass: 12.3285 9.0820 8.2141 1.4695 1.0406 1.1416 1.0849 1.0500 1.1211
irintensity: 6.2512 212.1371 70.4789 9.3449 0.0007 9.7601 0.0132 50.5194 40.8417
temp: 298.150 k
press: 1.00000 atm
elementType: 9 9 6 1 1
symmnumber: 1
zpe: 81744.3 jmol-1
zpe.correction: 0.031135 hartree
zpe.thermalcorrener: 0.034369 hartree
zpe.thermalcorrenthalpy: 0.035313 hartree
zpe.thermalcorrgfe: 0.006376 hartree
zpe.sumelectzpe: -238.721223 hartree
zpe.sumelectthermal: -238.717989 hartree
zpe.sumelectthermalent: -238.717044 hartree
zpe.sumelectthermalfe: -238.745982 hartree
dipole: -0.0002 2.5139 0.0000
dipole: 2.5139
quadrupole: -15.0548 -15.0191 -19.9677
quadrupole: 0.0013 0.0000 0.0000
quadrupole: 1.6257 1.6614 -3.2871 0.0013 0.0000 0.0000
hfenergy: -238.7523575 hartree
pointgroup: CS [SG(C1H2),X(F2)]
dipole: 0. 0.9890467 0.0005908 debye
dipolederiv: -0.7209446 -0.1611318 0.000034 -0.3007414 -0.4413472 0.0000353 -0.000184 -0.0000979 -0.2973358 -0.7209446 0.1611318 -0.000034 0.3007414 -0.4413472 0.0000353 0.000184 -0.0000979 -0.2973358 1.4184176 0. 0. 0. 0.9337659 0.0000433 0. -0.0000069 0.7503576 0.0117086 0. 0. 0. -0.0255248 -0.0636896 0. -0.1295337 -0.0777396 0.011763 0. 0. 0. -0.0255467 0.0635756 0. 0.1297364 -0.0779464 unknown
polarizability: 14.6233194|0.|12.0946831|0.|0.0045759|10.9164126 unknown
InChI: InChI=1S/CH2F2/c2-1-3/h1H2
charge 0 multiplicity 1
5 atoms
F  -1.15689 -0.278188 -0.000264
F  1.15689 -0.278188 -0.000264
C  0.0000 0.557761 0.000286
H  0.0000 1.150573 0.931115
H  0.0000 1.149942 -0.930873
