program: Gaussian 09
title: 000055228
version: EM64L-G09RevD.01
frameworkgroup: C1[X(C20H26N2O2)]
method: RPBEPBE
basis: SDD
operation: Freq
keyword: #p
keyword: freq=noraman
keyword: PBEPBE/SDD
title: #p freq=noraman PBEPBE/SDD
converged: YES YES NO NO
title: Mulliken charges:
elementType: O O N N C C C C C C C C C C C C C C C C C C C C H H H H H H H H H H H H H H H H H H H H H H H H H H
charge: -0.305142 -0.287514 -0.443733 -0.125921 0.022082 0.026930 0.277340 0.416088 0.378248 0.117864 -0.689938 -0.688277 -0.435259 -0.335153 -0.380199 -0.363958 -0.691971 -0.694625 0.157790 -0.354712 -0.350592 -0.266224 -0.241810 -0.794357 0.204033 0.195856 0.213253 0.241116 0.218571 0.202215 0.241017 0.217160 0.247181 0.235101 0.214820 0.319562 0.296310 0.209986 0.247403 0.225695 0.202412 0.234302 0.223684 0.231065 0.248058 0.220434 0.222664 0.258574 0.276103 0.206467
chargesum: 0.00000
title: Mulliken charges with hydrogens summed into heavy atoms:
elementType: O O N N C C C C C C C C C C C C C C C C C C C C
charge: -0.305142 -0.287514 -0.147423 -0.125921 0.226115 0.222786 0.277340 0.416088 0.378248 0.117864 -0.016997 -0.027885 -0.220440 -0.015591 -0.133018 -0.128858 -0.008887 -0.034228 0.157790 -0.123647 -0.102534 -0.045790 -0.019146 -0.053213
polarizability: 3.69838590e+02 2.71112943e+01 2.44269228e+02 4.52370594e+00 1.44970656e+01 1.87636482e+02
1716.lowfreq: -3.5681 -0.8133 0.0007 0.0007 0.0011 5.0222 14.0635 30.4569 37.5284
frequency: 14.0425 30.3260 37.5220 44.9708 52.3817 69.4228 70.3485 89.0174 101.0378 110.4033 122.6292 143.6791 149.9995 182.0616 183.7168 192.0286 207.4108 218.2654 238.1299 239.6663 262.3958 274.7927 295.9663 335.0448 345.7504 357.9110 375.8596 389.1952 414.4369 427.6329 443.3659 458.6744 463.4164 507.3232 509.4692 527.7613 546.2424 560.1474 583.3233 584.9976 593.2559 627.9506 653.7810 712.5976 718.7209 735.5517 744.8481 748.1953 764.4917 812.6615 831.3663 836.5472 838.7586 851.7931 854.7659 916.0256 924.0091 924.2802 926.0933 927.5071 935.6350 938.3646 942.7192 954.9749 960.3754 977.3984 997.0126 1010.9389 1041.5186 1042.8556 1099.2807 1105.1899 1111.9469 1119.7375 1146.2209 1149.7145 1165.7625 1170.7303 1178.3980 1183.5083 1189.7556 1204.7378 1210.6046 1245.4856 1265.3045 1302.7962 1320.3955 1321.9049 1327.4330 1340.9670 1346.3965 1368.2120 1377.1106 1380.1596 1381.2322 1386.2468 1395.2951 1396.4289 1421.2003 1430.6805 1449.2707 1455.2473 1455.3456 1466.6868 1467.5295 1467.6701 1469.2951 1472.3562 1483.6782 1488.1505 1488.9006 1497.1575 1518.6926 1573.6914 1591.1415 1595.8691 1628.5030 1646.7945 2973.2608 2979.0787 2985.6503 2986.9634 2987.9261 2991.6666 2992.7186 3079.9683 3083.4335 3083.6069 3090.9238 3092.8668 3093.5823 3094.8032 3095.2036 3101.3698 3102.9207 3106.2482 3127.6587 3141.8471 3155.5436 3156.4413 3164.7913 3168.7976 3182.5445 3552.5623
redmass: 4.0575 3.7359 4.1682 3.5737 3.8498 3.1319 3.7672 2.8098 3.6042 1.4678 2.0649 4.0530 3.4944 1.0376 1.0485 3.9036 3.0739 1.9210 1.6234 1.4126 3.3808 3.2443 4.2438 3.1837 3.5270 3.3415 4.4998 3.0787 3.0998 2.9181 2.7859 2.8558 3.5387 3.5659 4.4912 2.8912 3.9970 3.1728 2.5494 1.6120 5.8692 6.9393 4.4488 4.9190 3.7999 4.0118 1.3973 3.6962 3.9877 1.3657 3.7618 1.5978 1.5518 3.0211 3.2649 1.4287 2.1612 1.9383 1.6163 1.5447 1.3659 1.3534 1.3426 5.8717 1.3175 1.3033 2.6124 1.5552 1.8425 1.7006 1.7778 1.6608 1.9963 1.3861 2.0957 2.0797 1.1402 1.3209 2.0447 1.9438 2.2963 2.8975 2.8957 3.0980 1.5768 1.4174 1.3005 1.2860 2.2406 1.4196 1.3875 5.8339 4.1063 1.2541 1.2781 1.2248 1.2277 1.2344 3.9035 2.2937 1.0804 1.0492 1.0499 1.1980 1.0854 1.1432 1.0488 1.2669 1.3428 1.0894 1.1024 2.2524 2.4371 6.7778 5.7707 5.0957 6.6189 6.3692 1.0845 1.0849 1.0359 1.0360 1.0357 1.0360 1.0359 1.0996 1.0993 1.0993 1.0992 1.0996 1.0998 1.0985 1.1001 1.1002 1.1002 1.0897 1.0845 1.0896 1.0888 1.0937 1.0943 1.0993 1.0952 1.0761
irintensity: 0.4482 0.4288 0.6107 1.2607 0.6370 1.8880 2.4535 1.7211 0.4197 2.0202 1.7782 0.5825 0.5996 0.1619 0.1568 0.5678 2.7677 0.5816 2.0284 0.1533 1.4083 2.3759 0.6423 1.6560 0.2590 0.8806 3.2628 3.5089 0.1832 4.6531 0.4282 5.1366 2.5869 10.2488 4.2964 19.1214 3.7141 7.4438 28.3998 29.8999 1.6290 8.0401 0.7528 3.5595 0.1081 6.8875 73.1242 14.3836 20.7633 27.7807 21.6151 47.2768 5.6938 39.3538 5.4011 5.6590 25.3154 44.8763 22.8022 33.6744 0.6390 0.4514 0.2211 4.4257 0.3721 2.4607 3.3231 7.9723 4.9862 25.8905 5.1746 114.3490 130.9156 66.7941 8.6900 12.1048 17.9158 80.5264 62.0725 88.4845 31.3939 167.0761 276.1389 16.1503 12.1612 13.6851 22.2734 21.3126 5.9647 6.2491 12.7822 10.3862 77.6790 37.1867 20.5331 35.7406 34.0213 27.2753 14.2702 35.1250 37.1415 7.3552 5.9239 15.1837 9.4190 9.1392 3.2664 41.9123 110.6441 42.7808 6.3692 214.1061 677.8996 3.8783 118.7495 13.0156 7.0965 630.3379 26.7020 26.1793 17.6652 29.0120 16.2241 23.9355 32.2748 8.3361 12.3774 12.0760 62.9487 45.8085 21.3815 12.5317 27.1118 38.2570 29.0816 23.8228 0.3694 16.4672 13.3196 36.2218 9.3202 25.6585 18.0652 23.7446
temp: 298.150 k
press: 1.00000 atm
elementType: 8 8 7 7 6 6 6 6 6 6 6 6 6 6 6 6 6 6 6 6 6 6 6 6 1 1 1 1 1 1 1 1 1 1 1 1 1 1 1 1 1 1 1 1 1 1 1 1 1 1
symmnumber: 1
zpe: 1093009.7 jmol-1
zpe.correction: 0.416305 hartree
zpe.thermalcorrener: 0.441487 hartree
zpe.thermalcorrenthalpy: 0.442431 hartree
zpe.thermalcorrgfe: 0.359708 hartree
zpe.sumelectzpe: -1035.881530 hartree
zpe.sumelectthermal: -1035.856348 hartree
zpe.sumelectthermalent: -1035.855404 hartree
zpe.sumelectthermalfe: -1035.938127 hartree
dipole: 1.3454 -2.0529 0.7329
dipole: 2.5616
quadrupole: -128.7122 -134.3738 -135.3093
quadrupole: -12.3097 -1.2966 6.1391
quadrupole: 4.0862 -1.5754 -2.5108 -12.3097 -1.2966 6.1391
hfenergy: -1036.297835 hartree
pointgroup: C01 [X(C20H26N2O2)]
dipole: -0.4209459 -0.5234067 0.751351 debye
polarizability: 373.0154048|12.6304062|184.9850038|15.7591206|-0.0609141|243.7438915 unknown
InChI: InChI=1S/C20H26N2O2/c1-14(2)23-18-12-10-17(11-13-18)21-16(5)22-19-8-6-7-9-20(19)24-15(3)4/h6-15,21H,1-5H3
charge 0 multiplicity 1
50 atoms
O  -2.899933 -1.196729 0.7447
O  5.529511 0.28378 -0.40275
N  0.278895 1.32604 1.468335
N  -1.168259 0.759241 -0.302597
C  -3.621127 -2.425593 1.176858
C  5.83833 -0.353925 -1.71185
C  -3.320233 -0.518596 -0.418164
C  1.555593 1.027757 0.915707
C  4.185754 0.483118 -0.03528
C  -2.427579 0.505172 -0.888131
C  -4.843975 -2.051801 2.035539
C  -2.583216 -3.248483 1.948943
C  2.696572 1.306564 1.721937
C  1.751117 0.473116 -0.374532
C  3.992606 1.037832 1.255479
C  3.05633 0.201617 -0.842617
C  5.609499 -1.874514 -1.633403
C  7.298098 0.016021 -1.995613
C  -0.999048 1.17813 0.930487
C  -4.511946 -0.808312 -1.124903
C  -2.776225 1.193039 -2.081104
C  -4.840211 -0.092151 -2.299488
C  -3.971127 0.912697 -2.777935
C  -2.12231 1.56026 1.887681
H  -3.936814 -2.981564 0.270163
H  5.184665 0.097873 -2.486945
H  -5.394605 -2.962722 2.33513
H  -5.538948 -1.388722 1.492779
H  -4.516163 -1.530098 2.952664
H  -3.029887 -4.195254 2.303719
H  -1.718191 -3.482167 1.305921
H  -2.219565 -2.682389 2.82484
H  4.871238 1.254196 1.870607
H  3.167328 -0.227444 -1.8429
H  2.567617 1.738606 2.723543
H  0.874138 0.265716 -0.990153
H  0.303629 1.704495 2.415939
H  5.817772 -2.344004 -2.612533
H  4.571834 -2.116958 -1.347367
H  6.286823 -2.318197 -0.882324
H  7.621099 -0.408841 -2.963199
H  7.420726 1.111849 -2.03131
H  7.953644 -0.380741 -1.200465
H  -5.195589 -1.58535 -0.769765
H  -2.073767 1.947901 -2.450119
H  -5.768432 -0.325736 -2.832338
H  -4.214809 1.469024 -3.689459
H  -2.934461 2.057173 1.330843
H  -2.544198 0.645557 2.340151
H  -1.7812 2.240216 2.688979
