program: Gaussian 09
title: 000006344
version: EM64L-G09RevD.01
frameworkgroup: CS[SG(CH2),X(Cl2)]
method: RPBEPBE
basis: SDD
operation: Freq
keyword: #pfreq=noraman
keyword: PBEPBE/SDD
title: #p freq=noraman PBEPBE/SDD
converged: YES YES YES YES
title: Mulliken charges:
elementType: Cl Cl C H H
charge: 0.008030 0.008030 -0.643918 0.313915 0.313943
chargesum: 0.00000
title: Mulliken charges with hydrogens summed into heavy atoms:
elementType: Cl Cl C
charge: 0.008030 0.008030 -0.016061
polarizability: 1.45265059e+01 8.99219007e-04 2.22769618e+01 4.91418036e-09 -4.62788541e-08 4.29988140e+01
1716.lowfreq: -14.4537 0.0037 0.0037 0.0038 8.6016 9.2527 257.3162 640.1072 660.2650
frequency: 257.3162 640.1072 660.2648 865.4555 1128.2330 1256.8589 1406.1763 3098.8277 3208.1477
redmass: 19.3257 7.7253 9.8685 1.3342 1.0177 1.0885 1.0712 1.0519 1.1188
irintensity: 0.6824 15.0821 161.4579 2.9967 0.0000 27.7306 0.1794 13.5063 4.9625
temp: 298.150 k
press: 1.00000 atm
elementType: 17 17 6 1 1
symmnumber: 1
zpe: 74894.5 jmol-1
zpe.correction: 0.028526 hartree
zpe.thermalcorrener: 0.032208 hartree
zpe.thermalcorrenthalpy: 0.033152 hartree
zpe.thermalcorrgfe: 0.001530 hartree
zpe.sumelectzpe: -959.163276 hartree
zpe.sumelectthermal: -959.159594 hartree
zpe.sumelectthermalent: -959.158650 hartree
zpe.sumelectthermalfe: -959.190272 hartree
dipole: -0.0002 2.0797 0.0000
dipole: 2.0797
quadrupole: -31.1740 -29.4685 -34.6540
quadrupole: 0.0003 0.0000 0.0000
quadrupole: 0.5915 2.2970 -2.8885 0.0003 0.0000 0.0000
hfenergy: -959.1918022 hartree
pointgroup: CS [SG(C1H2),X(Cl2)]
dipole: 0. 0.8182163 0.0000448 debye
dipolederiv: -0.6367202 -0.1019245 0.0000074 -0.2599518 -0.2159473 -0.0000023 -0.0000573 -0.0000192 -0.1329073 -0.6367202 0.1019245 -0.0000074 0.2599518 -0.2159473 -0.0000023 0.0000573 -0.0000192 -0.1329073 1.3908416 0. 0. 0. 0.4506116 0.0000588 0. -0.0000018 0.2472481 -0.0587029 0. 0. 0. -0.0093563 -0.0811606 0. -0.0704432 0.0093145 -0.0586981 0. 0. 0. -0.0093607 0.0811063 0. 0.0704833 0.009252 unknown
polarizability: 42.998814|0.|22.2769614|0.|0.0020765|14.5265063 unknown
InChI: InChI=1S/CH2Cl2/c2-1-3/h1H2
charge 0 multiplicity 1
5 atoms
Cl -1.54683 -0.337287 -0.000071
Cl 1.54683 -0.337287 -0.000071
C  0.0000 0.689727 0.000085
H  0.0000 1.287626 0.917566
H  0.0000 1.28742 -0.917509
