program: Gaussian 09
title: 000060287
version: EM64L-G09RevD.01
frameworkgroup: C1[X(C16H25NO2)]
method: RPBEPBE
basis: SDD
operation: Freq
keyword: #p
keyword: freq=noraman
keyword: PBEPBE/SDD
title: #p freq=noraman PBEPBE/SDD
converged: YES YES NO NO
title: Mulliken charges:
elementType: O O N C C C C C C C C C C C C C C C C H H H H H H H H H H H H H H H H H H H H H H H H H
charge: -0.261250 -0.252624 -0.096716 -0.383361 -0.327933 -0.328820 -0.299751 0.012520 0.386419 0.364073 -0.696118 -0.673577 0.498099 0.125423 -0.619033 -0.619039 -0.812807 -0.812343 -0.814567 0.216075 0.241819 0.204275 0.184833 0.207908 0.183956 0.248688 0.225912 0.253563 0.217250 0.204564 0.210286 0.225921 0.208514 0.236396 0.239105 0.225774 0.257016 0.219570 0.229464 0.262912 0.218041 0.225721 0.226501 0.237343
chargesum: 0.00000
title: Mulliken charges with hydrogens summed into heavy atoms:
elementType: O O N C C C C C C C C C C C C C C C C
charge: -0.261250 -0.252624 -0.096716 0.074533 0.061175 0.063044 0.174849 0.012520 0.386419 0.364073 -0.020741 -0.028856 0.498099 0.125423 -0.382636 -0.379933 -0.110448 -0.101927 -0.125003
polarizability: 2.72443217e+02 6.61526752e-01 1.92106561e+02 4.73956836e+00 4.38624596e+00 1.25900631e+02
1716.lowfreq: -8.7025 -2.7714 -0.0007 -0.0004 -0.0001 2.3379 15.7400 25.2684 28.2722
frequency: 15.4928 25.1220 27.9886 37.1290 40.0306 62.9294 72.4299 82.9144 107.7247 126.3271 133.1768 162.7899 173.9750 185.6284 202.9830 218.6794 238.5952 251.4464 273.9201 280.6288 288.5421 312.7677 316.3292 333.0816 378.7603 384.3098 423.0118 456.3307 494.5494 513.6352 527.5961 531.9599 559.2201 582.3539 594.6325 694.4900 738.7133 749.4697 774.2432 792.0947 798.9282 808.9538 866.5470 886.0431 896.8191 918.3065 939.7045 957.7373 988.0715 1018.2823 1020.1926 1023.3017 1043.5547 1046.9670 1047.3629 1052.7165 1056.0920 1069.3903 1073.7971 1082.9292 1090.4748 1124.1851 1170.6956 1181.7007 1210.8881 1231.6395 1248.3403 1259.1179 1282.5815 1287.7089 1310.3485 1313.6528 1322.9101 1359.5320 1360.1512 1363.9794 1382.4646 1388.2024 1395.3718 1397.3733 1399.0513 1403.0734 1414.6114 1436.2869 1447.6930 1459.5177 1464.2632 1465.3449 1467.3697 1471.7065 1472.3402 1473.5715 1478.1667 1479.3416 1487.6917 1488.3902 1491.5058 1496.8667 1572.7743 1602.1464 1617.9615 2845.1171 2854.0124 2964.1017 2975.3732 2980.7017 2984.6824 2988.3453 2990.0099 3017.6065 3026.8224 3037.1731 3046.8373 3056.9976 3073.7792 3074.1901 3076.9869 3078.2271 3086.2505 3086.5936 3088.1567 3091.9856 3092.5371 3116.8806 3121.8139 3127.0475
redmass: 3.4520 3.7354 4.0451 1.0207 3.6237 2.4162 4.3218 3.5338 2.1987 1.1508 1.9418 1.4491 1.8796 2.3430 3.4726 2.6937 1.3231 1.8051 2.4821 2.5920 1.8671 3.1268 3.2882 3.3879 4.9201 2.7498 4.1075 2.6100 2.8998 3.9311 3.0232 4.2477 4.3083 3.4839 4.6997 4.4735 2.4805 2.7955 4.2148 1.4558 1.1709 1.2835 1.3366 6.0499 1.3098 1.8853 2.4502 3.4839 2.2925 2.0316 3.3828 1.6359 1.5472 1.5668 1.6897 1.7314 3.6076 1.8124 2.4286 2.7594 1.6919 1.6986 2.0546 1.6564 2.3873 2.4056 1.4001 1.4935 1.1390 1.2036 1.2812 6.0704 1.2973 7.1424 1.3048 1.3334 1.2989 1.2607 1.2331 1.2280 1.3257 1.2660 2.0325 1.8291 1.1163 1.0770 1.0521 1.1026 1.0573 1.0776 1.0815 1.0557 1.0791 1.1695 1.0889 1.3278 1.0715 1.0663 7.2662 8.9793 5.8517 1.0719 1.0711 1.0582 1.0388 1.0356 1.0357 1.0365 1.0369 1.0935 1.0978 1.0877 1.0574 1.0946 1.0966 1.0972 1.0990 1.0981 1.1007 1.0999 1.1001 1.1005 1.1003 1.0911 1.0919 1.1099
irintensity: 0.3498 0.0992 0.3779 0.5147 0.4346 0.2749 1.2540 0.3089 0.5516 1.6538 0.7962 4.4867 2.0821 0.5353 1.1208 0.0639 1.4322 0.0179 0.5540 2.7032 1.3761 7.7095 14.3102 0.5460 0.3203 10.4954 7.3613 2.7793 3.4427 3.3048 2.6248 1.0396 0.4548 3.3787 0.7166 16.4455 9.1774 3.5084 0.6369 1.3504 6.7585 6.7709 21.3101 32.7866 0.0513 0.2131 2.0716 9.4352 0.8429 83.1647 193.6827 17.2398 3.5127 1.3952 3.9103 40.2951 24.6936 76.8810 15.5586 10.8467 23.3289 9.4460 87.1929 4.3258 46.8028 137.2511 20.5369 26.9885 2.8532 18.1390 5.8720 3.6826 20.9620 2.1077 14.7985 2.4664 2.6842 23.3733 13.6670 15.7094 17.3170 11.9008 8.5801 39.0498 21.1522 20.1106 9.0115 6.3895 0.9191 7.7180 4.9705 13.0514 5.4301 37.4516 19.5320 13.1359 12.7559 11.0707 34.4350 183.9630 73.2550 37.6459 199.4874 37.4364 35.4210 25.5085 34.3849 31.9027 17.0400 5.1739 30.4861 30.5415 33.9429 21.7780 17.8546 18.3887 20.5462 76.0379 34.9769 15.4362 20.8956 47.3588 16.9624 27.6798 19.8101 11.9778
temp: 298.150 k
press: 1.00000 atm
elementType: 8 8 7 6 6 6 6 6 6 6 6 6 6 6 6 6 6 6 6 1 1 1 1 1 1 1 1 1 1 1 1 1 1 1 1 1 1 1 1 1 1 1 1 1
symmnumber: 1
zpe: 989400.9 jmol-1
zpe.correction: 0.376843 hartree
zpe.thermalcorrener: 0.399171 hartree
zpe.thermalcorrenthalpy: 0.400115 hartree
zpe.thermalcorrgfe: 0.322408 hartree
zpe.sumelectzpe: -828.420184 hartree
zpe.sumelectthermal: -828.397856 hartree
zpe.sumelectthermalent: -828.396912 hartree
zpe.sumelectthermalfe: -828.474619 hartree
dipole: -0.1513 -1.8444 -0.2526
dipole: 1.8677
quadrupole: -97.3943 -112.9368 -118.6052
quadrupole: -2.1807 -0.8896 2.8440
quadrupole: 12.2511 -3.2913 -8.9598 -2.1807 -0.8896 2.8440
hfenergy: -828.7970269 hartree
pointgroup: C01 [X(C16H25N1O2)]
dipole: -0.0701616 -0.3394234 0.6479398 debye
polarizability: 272.4197347|4.6804019|136.2912255|2.2775617|-24.4362704|181.7394497 unknown
InChI: InChI=1S/C16H25NO2/c1-6-17(7-2)8-9-19-16(18)15-13(4)10-12(3)11-14(15)5/h10-11H,6-9H2,1-5H3
charge 0 multiplicity 1
44 atoms
O  0.411953 0.652367 0.73607
O  0.18826 0.194601 -1.5335
N  4.094939 -0.199033 0.313338
C  2.651262 -0.461616 0.524389
C  4.608524 -0.700092 -0.987333
C  4.954424 -0.523859 1.480748
C  1.875612 0.871925 0.510258
C  -1.785135 0.086066 -0.078996
C  -2.20581 -0.636163 1.083086
C  -2.753547 0.603101 -1.000057
C  3.987105 0.022584 -2.198347
C  6.276296 0.268768 1.504503
C  -4.569136 -0.303596 0.416942
C  -0.335853 0.290003 -0.392335
C  -3.59201 -0.819687 1.300065
C  -4.126162 0.409091 -0.722171
C  -1.236425 -1.241408 2.086542
C  -2.362888 1.372905 -2.250722
C  -6.048481 -0.532574 0.668661
H  2.476668 -0.97552 1.49114
H  2.246576 -1.118882 -0.270526
H  5.701968 -0.542637 -1.003241
H  4.440735 -1.803568 -1.08757
H  4.381137 -0.270421 2.392324
H  5.176965 -1.62054 1.53851
H  2.022198 1.386092 -0.453693
H  2.182741 1.522933 1.343363
H  2.889968 -0.102817 -2.238758
H  4.208693 1.103867 -2.152868
H  4.40687 -0.381927 -3.138258
H  6.931244 0.012555 0.652704
H  6.068949 1.352398 1.462869
H  6.837063 0.048896 2.432129
H  -3.915449 -1.382047 2.184979
H  -4.867387 0.823706 -1.41655
H  -0.428837 -1.809975 1.591307
H  -0.74488 -0.457191 2.687426
H  -1.769636 -1.925913 2.768422
H  -1.663012 2.198567 -2.027346
H  -1.843768 0.720059 -2.973238
H  -3.257195 1.800664 -2.734956
H  -6.265141 -0.635919 1.746367
H  -6.659722 0.297299 0.272439
H  -6.394876 -1.460558 0.172987
