program: Gaussian 09
title: 000060241
version: EM64L-G09RevD.01
frameworkgroup: C1[X(C9H17O5P)]
method: RPBEPBE
basis: SDD
operation: Freq
keyword: #p
keyword: freq=noraman
keyword: PBEPBE/SDD
title: #p freq=noraman PBEPBE/SDD
converged: YES YES NO NO
title: Mulliken charges:
elementType: P O O O O O C C C C C C C C C H H H H H H H H H H H H H H H H H
charge: 1.264514 -0.456362 -0.426394 -0.523032 -0.589560 -0.194117 0.284444 -0.407568 -0.146543 -0.365755 -0.725591 -0.680876 -0.687691 0.323250 -0.731383 0.215032 0.239393 0.238732 0.211606 0.222019 0.223503 0.208055 0.208579 0.194590 0.262197 0.237139 0.246436 0.236680 0.368417 0.244413 0.253893 0.251979
chargesum: 0.00000
title: Mulliken charges with hydrogens summed into heavy atoms:
elementType: P O O O O O C C C C C C C C C
charge: 1.264514 -0.456362 -0.057976 -0.523032 -0.589560 -0.194117 0.284444 0.046857 -0.146543 0.084584 -0.072014 -0.015510 0.032564 0.323250 0.018902
polarizability: 1.52615765e+02 1.82427788e+00 1.34442617e+02 -4.66827918e-02 -1.82082974e+00 1.23812115e+02
1716.lowfreq: -13.5484 0.0016 0.0017 0.0020 5.8090 10.2272 35.5746 40.5476 67.4721
frequency: 35.3274 40.5409 67.3690 81.3127 84.7998 129.2246 136.5126 162.9074 187.6139 189.9387 226.1950 231.9683 243.7741 252.2305 254.7740 263.1370 299.9246 311.6614 319.0709 361.6461 387.6970 398.0469 419.4907 432.2437 450.3886 484.7608 519.5836 553.9693 576.2916 609.0984 624.8588 680.8554 763.5974 814.9559 836.5643 890.6306 894.1430 914.0383 937.5025 943.0500 968.8708 975.5077 994.7151 1013.6042 1040.0145 1053.1893 1069.8389 1090.1006 1110.2274 1158.8127 1179.4467 1189.3871 1210.5016 1275.0950 1308.4921 1317.4281 1342.4974 1355.7581 1378.3818 1378.7187 1388.1757 1399.7015 1428.7142 1449.8133 1452.2638 1453.5802 1458.8319 1461.7490 1469.5933 1475.0415 1479.8316 1483.8075 1675.1373 2970.6561 2976.4995 2979.9163 2984.7156 2986.1611 3008.5946 3040.3174 3065.5406 3072.1654 3077.2185 3079.2616 3084.6981 3099.3947 3103.1227 3117.8452 3141.7562 3508.2309
redmass: 5.3626 2.9664 4.0643 1.6692 2.2794 2.3596 7.4338 3.5337 3.3184 1.4660 2.7767 1.5841 2.5236 1.7883 2.8728 1.5708 3.0187 4.7984 3.4492 3.7825 2.1380 2.5739 3.8874 1.4146 2.2547 3.4746 3.7169 3.0836 4.5641 5.0209 7.3635 8.7268 3.6932 3.9775 6.9126 2.2090 1.9907 1.8143 1.8460 2.4313 1.9198 2.0247 1.6165 1.4258 1.6731 6.9039 2.4679 2.1246 1.7529 3.1800 1.9827 2.0340 1.8206 1.9488 1.4793 1.6083 1.3687 1.4087 1.2209 1.1956 1.1947 1.2008 1.0812 1.0553 1.0507 1.0652 1.0544 1.0490 1.0673 1.0524 1.0552 1.0635 10.4117 1.0367 1.0585 1.0582 1.0370 1.0425 1.0359 1.1017 1.0990 1.0997 1.0991 1.0999 1.1000 1.0974 1.0993 1.0976 1.1016 1.0656
irintensity: 0.5657 2.3598 1.4637 0.1995 0.2838 2.2854 1.3221 2.8031 15.8531 13.5406 7.1602 1.1592 1.3549 2.5855 11.7435 1.5231 4.2149 6.2464 1.3819 2.6752 1.6241 9.0300 53.8433 155.3296 25.4806 5.8437 9.7405 4.1483 22.6058 79.1220 12.2802 106.7152 4.3336 82.5336 275.9100 12.2175 22.0461 13.5700 63.2585 58.5511 19.4927 59.2400 17.7820 4.5071 6.1236 93.5045 70.3586 31.9101 34.6609 383.0077 9.1247 2.6322 16.9895 4.5123 12.6450 22.5179 15.4223 8.4816 19.6416 52.0247 17.8053 21.6745 6.0233 22.9586 16.1192 4.1866 11.9332 0.5545 20.4932 12.9807 9.5176 20.4182 221.7472 16.9628 15.8703 53.8239 33.0054 20.0362 2.0143 11.0518 33.2655 1.5249 39.5689 16.5216 34.0916 6.6270 12.8969 12.9760 11.2319 18.6933
temp: 298.150 k
press: 1.00000 atm
elementType: 15 8 8 8 8 8 6 6 6 6 6 6 6 6 6 1 1 1 1 1 1 1 1 1 1 1 1 1 1 1 1 1
symmnumber: 1
zpe: 668680.3 jmol-1
zpe.correction: 0.254687 hartree
zpe.thermalcorrener: 0.272923 hartree
zpe.thermalcorrenthalpy: 0.273867 hartree
zpe.thermalcorrgfe: 0.209063 hartree
zpe.sumelectzpe: -1069.292841 hartree
zpe.sumelectthermal: -1069.274605 hartree
zpe.sumelectthermalent: -1069.273660 hartree
zpe.sumelectthermalfe: -1069.338465 hartree
dipole: 2.0815 -1.9335 6.4304
dipole: 7.0300
quadrupole: -97.8268 -92.8388 -104.2749
quadrupole: 0.1222 -11.4552 2.3085
quadrupole: 0.4867 5.4747 -5.9614 0.1222 -11.4552 2.3085
hfenergy: -1069.5475276 hartree
pointgroup: C01 [X(C9H17O5P1)]
dipole: -0.8951123 -0.7855339 -2.4962953 debye
polarizability: 152.6336667|-1.4276633|134.3965244|-1.1096526|1.8299679|123.8403064 unknown
InChI: InChI=1S/C9H17O5P/c1-7(10)14-15(12)9(4,11)5-8(2,3)6-13-15/h11H,5-6H2,1-4H3
charge 0 multiplicity 1
32 atoms
P  0.509903 0.763131 0.595962
O  -0.134641 -0.561198 1.506061
O  -1.812108 2.09568 0.201656
O  1.642222 0.003623 -0.589622
O  1.082359 1.949789 1.47927
O  3.185082 -0.818106 0.972029
C  -2.108683 -1.04343 -0.026254
C  -1.684985 0.0306 -1.082395
C  -0.907165 1.276595 -0.608751
C  -0.864562 -1.597365 0.71534
C  -2.732654 -2.233717 -0.805675
C  -3.138714 -0.498325 0.994208
C  -0.327406 2.093328 -1.774536
C  2.854264 -0.63365 -0.210019
C  3.6271 -1.023159 -1.451875
H  -1.061238 -0.464984 -1.853196
H  -2.594472 0.407441 -1.590987
H  -1.158031 -2.334843 1.480935
H  -0.158844 -2.072052 0.002993
H  -3.046224 -3.037772 -0.114455
H  -3.630097 -1.900378 -1.358435
H  -2.023774 -2.666334 -1.537779
H  -4.005118 -0.055023 0.471195
H  -3.505061 -1.320144 1.638308
H  -2.699916 0.28328 1.632481
H  0.203262 2.991963 -1.408497
H  0.381392 1.49876 -2.374649
H  -1.161407 2.422804 -2.420681
H  -1.315157 2.877841 0.564118
H  2.999564 -1.638843 -2.118391
H  3.911135 -0.115158 -2.011822
H  4.531773 -1.578953 -1.165433
