program: Gaussian 09
title: 000060244
version: EM64L-G09RevD.01
frameworkgroup: C1[X(C18H22N2O2)]
method: RPBEPBE
basis: SDD
operation: Freq
keyword: #p
keyword: freq=noraman
keyword: PBEPBE/SDD
title: #p freq=noraman PBEPBE/SDD
converged: YES YES NO NO
title: Mulliken charges:
elementType: O O N N C C C C C C C C C C C C C C C C C C H H H H H H H H H H H H H H H H H H H H H H
charge: -0.303483 -0.263686 -0.103876 -0.001455 -0.392763 -0.195206 -0.325833 -0.310351 0.506984 -0.666120 -0.690387 -0.449855 -0.377512 -0.221721 -0.230470 0.251796 -0.238828 0.255212 -0.283970 -0.272337 -0.328951 -0.333645 0.224671 0.214330 0.253780 0.188689 0.207276 0.189869 0.208402 0.233078 0.203137 0.208913 0.258286 0.201641 0.206149 0.236771 0.244085 0.228184 0.226810 0.230699 0.267698 0.255138 0.245519 0.243336
chargesum: 0.00000
title: Mulliken charges with hydrogens summed into heavy atoms:
elementType: O O N N C C C C C C C C C C C C C C C C C C
charge: -0.303483 -0.263686 -0.103876 -0.001455 0.046238 0.058573 0.070132 0.087919 0.506984 -0.020992 -0.024311 -0.213085 -0.133427 0.006464 -0.003660 0.251796 -0.008129 0.255212 -0.016273 -0.017199 -0.083432 -0.090309
polarizability: 2.62252540e+02 -2.09859801e+00 1.86639343e+02 -1.95837304e+00 -3.19444565e+01 1.88504690e+02
1716.lowfreq: -10.6712 -4.8700 -0.0004 0.0003 0.0008 7.0544 9.9199 18.9134 27.4335
frequency: 7.4952 18.8766 27.3706 28.7502 46.3794 58.0622 68.6979 73.0441 84.5471 90.1217 151.2364 169.3545 185.0207 191.7225 212.1027 238.8906 260.7319 286.3455 296.0545 316.3887 354.4021 368.3833 384.8211 402.6923 429.0943 445.9403 459.2371 465.7564 537.9223 544.0698 610.4368 616.2615 656.7773 660.5735 673.8588 704.5419 737.2825 750.0608 769.1346 792.0026 794.3669 800.6166 823.8878 846.3924 855.1580 880.3440 898.4405 915.1198 919.0352 958.5368 977.2645 980.7180 981.8487 989.0977 990.7494 997.1575 997.4990 1026.4810 1042.6518 1054.8510 1066.0782 1073.9738 1076.8875 1082.1427 1086.5194 1088.3662 1115.2409 1172.9788 1173.8260 1187.3134 1207.1854 1209.9851 1217.7884 1247.1000 1267.6345 1276.4310 1291.2619 1295.8634 1302.5505 1320.0291 1323.0458 1341.4014 1362.5147 1366.7942 1373.2441 1384.2050 1387.0919 1388.5696 1399.9952 1440.8217 1451.0052 1460.5016 1464.4739 1469.3988 1472.2374 1477.7635 1485.0488 1487.1131 1489.6114 1554.8341 1581.9844 1593.7584 1615.5398 1621.0227 2856.6498 2862.7347 2878.1226 2982.4341 2985.4262 3028.5290 3035.5026 3037.7751 3056.2246 3074.0096 3075.9227 3091.0989 3101.4530 3120.0212 3127.7301 3137.7117 3139.9835 3141.1306 3151.1334 3165.7166 3172.5836 3186.0628
redmass: 3.8716 4.6253 3.9903 3.3379 4.4579 3.4935 2.1628 6.2187 2.3731 4.1310 5.3059 2.2923 3.0348 1.5735 3.9380 1.9104 2.8374 2.3557 6.2869 2.6870 2.6247 2.4977 5.6017 2.8279 3.0940 3.7977 4.9666 2.7953 4.1428 3.1062 6.0912 6.3959 7.5405 6.9877 4.3151 1.8318 2.3712 3.1857 1.9982 1.6436 1.2480 2.2237 3.3979 1.5733 1.2537 3.8243 1.2530 2.0974 1.4464 6.4880 1.4064 2.5366 1.5172 1.4352 5.8881 1.3416 2.0765 2.2071 2.8292 3.6686 2.0528 2.2919 1.8899 1.6692 2.0238 2.0787 1.8311 1.4405 1.2926 1.1155 1.7009 1.7854 2.1758 2.9392 1.2711 1.2664 1.2786 1.4152 7.6751 1.3310 1.4577 1.3610 1.3514 1.3227 1.4679 1.2342 4.8018 1.2437 1.9009 2.1183 1.0801 1.9587 1.0531 1.0653 1.0683 1.0438 2.2906 1.0751 1.0799 8.2356 5.7845 6.1706 6.2158 10.4651 1.0720 1.0715 1.0707 1.0354 1.0361 1.0873 1.0844 1.0876 1.0884 1.0984 1.0977 1.1003 1.1003 1.0868 1.0866 1.0886 1.0916 1.0915 1.0961 1.1015 1.0961 1.0955
irintensity: 0.2611 0.0059 0.0521 0.0906 0.0476 0.3075 0.2631 0.3562 0.1002 0.7395 3.5414 5.0698 1.1037 0.2113 0.2562 0.6777 1.5623 1.1612 13.2718 0.1680 4.0869 0.0379 3.1992 0.9044 3.2128 3.0292 1.5172 3.1085 3.0816 35.8578 21.0939 0.4969 10.9142 2.2192 58.6294 54.8025 5.3685 13.5969 34.9782 9.8396 1.6238 10.2088 14.1756 28.4425 0.4778 19.1810 0.2962 10.2343 6.4446 1.3888 1.5672 49.3307 8.8239 0.6340 1.5043 0.8047 23.6808 5.2777 15.8372 140.6560 40.3581 25.4394 36.6610 7.7435 15.0223 43.9871 13.3569 13.2552 9.5880 4.2735 48.3567 32.0454 21.6851 285.3240 7.4412 10.3890 22.8944 3.8526 1.4667 11.3486 7.0378 4.5154 2.5561 6.2200 0.8960 14.3481 0.9883 26.0895 26.6040 6.3382 0.5983 4.5925 5.7051 8.5842 4.7399 4.6656 16.4703 8.0982 11.2184 37.6670 10.5233 7.5209 10.2241 117.1715 34.1810 130.4662 179.0839 24.4599 34.0129 16.9045 4.5770 13.8233 15.5405 34.3168 84.4449 37.7911 29.0483 5.8806 0.0276 25.5849 18.9715 8.1739 35.6489 20.5150 8.7778 4.2054
temp: 298.150 k
press: 1.00000 atm
elementType: 8 8 7 7 6 6 6 6 6 6 6 6 6 6 6 6 6 6 6 6 6 6 1 1 1 1 1 1 1 1 1 1 1 1 1 1 1 1 1 1 1 1 1 1
symmnumber: 1
zpe: 951412.5 jmol-1
zpe.correction: 0.362374 hartree
zpe.thermalcorrener: 0.384191 hartree
zpe.thermalcorrenthalpy: 0.385135 hartree
zpe.thermalcorrgfe: 0.306699 hartree
zpe.sumelectzpe: -957.421206 hartree
zpe.sumelectthermal: -957.399389 hartree
zpe.sumelectthermalent: -957.398445 hartree
zpe.sumelectthermalfe: -957.476882 hartree
dipole: 3.2755 1.6941 1.3640
dipole: 3.9318
quadrupole: -132.5123 -129.7781 -127.5314
quadrupole: -8.7714 1.3839 -2.2718
quadrupole: -2.5717 0.1625 2.4092 -8.7714 1.3839 -2.2718
hfenergy: -957.7835803 hartree
pointgroup: C01 [X(C18H22N2O2)]
dipole: 1.4971618 -0.2060936 0.3300892 debye
polarizability: 222.0939644|-46.3048743|209.0403168|-17.0542449|-19.5491574|206.2622922 unknown
InChI: InChI=1S/C18H22N2O2/c1-3-20(4-2)14-17(15-8-6-5-7-9-15)22-18(21)16-10-12-19-13-11-16/h5-13,17H,3-4,14H2,1-2H3
charge 0 multiplicity 1
44 atoms
O  -0.061124 -0.246628 0.077111
O  -0.731164 0.551759 -2.021357
N  1.770739 2.005178 -0.225633
N  -4.734462 1.389906 1.084546
C  2.208837 0.660612 0.187339
C  1.331466 -0.467752 -0.421396
C  1.970265 3.047118 0.815993
C  2.275511 2.397495 -1.569948
C  1.787148 -1.849028 0.008537
C  0.9665 2.939236 1.980057
C  1.365478 3.415322 -2.282506
C  2.540392 -2.651984 -0.882321
C  1.519287 -2.331535 1.314562
C  3.026032 -3.9153 -0.474762
C  1.995552 -3.596938 1.720068
C  -0.957797 0.3547 -0.802449
C  2.754686 -4.391181 0.828312
C  -2.247877 0.696585 -0.121344
C  -3.298414 1.249436 -0.8941
C  -2.459956 0.495542 1.264644
C  -4.512203 1.57763 -0.2524
C  -3.709999 0.854256 1.815629
H  2.14709 0.573527 1.286617
H  3.269552 0.44242 -0.092089
H  1.307182 -0.383095 -1.522981
H  3.016325 3.032837 1.214771
H  1.836261 4.029808 0.329494
H  3.322267 2.789743 -1.508596
H  2.318441 1.484766 -2.192397
H  -0.066765 2.988353 1.59465
H  1.076596 1.990835 2.537044
H  1.119898 3.766789 2.697695
H  0.356814 2.986673 -2.404341
H  1.279461 4.362845 -1.7203
H  1.771266 3.656812 -3.282732
H  2.740779 -2.292699 -1.899395
H  0.917323 -1.72445 1.999472
H  3.605667 -4.528824 -1.173397
H  1.774754 -3.966073 2.72792
H  3.124661 -5.373056 1.143863
H  -3.155078 1.413416 -1.966192
H  -1.668813 0.072032 1.887695
H  -5.346916 2.007437 -0.816839
H  -3.912464 0.713477 2.883156
