program: Gaussian 09
title: 000060207
version: EM64L-G09RevD.01
frameworkgroup: C1[X(C5H2Cl4O3)]
method: RPBEPBE
basis: SDD
operation: Freq
keyword: #p
keyword: freq=noraman
keyword: PBEPBE/SDD
title: #p freq=noraman PBEPBE/SDD
converged: NO YES NO NO
title: Mulliken charges:
elementType: Cl Cl Cl Cl O O O C C C C C H H
charge: 0.076955 0.083393 0.058696 0.080344 -0.199899 -0.367217 -0.150824 0.252976 0.000758 -0.605129 -0.209545 0.243687 0.354135 0.381670
chargesum: 0.00000
title: Mulliken charges with hydrogens summed into heavy atoms:
elementType: Cl Cl Cl Cl O O O C C C C C
charge: 0.076955 0.083393 0.058696 0.080344 -0.199899 0.014453 -0.150824 0.252976 0.000758 -0.250994 -0.209545 0.243687
polarizability: 1.21499184e+02 -8.20117286e+00 1.05628931e+02 1.56179765e+01 -1.49960408e+00 7.33509643e+01
1716.lowfreq: -7.0562 -0.0026 0.0014 0.0023 4.5916 8.2367 47.5886 53.7012 87.5630
frequency: 47.5840 53.6948 87.5582 102.9211 148.7227 190.2421 196.4556 215.0655 250.8741 292.4904 322.4720 337.6677 395.5931 417.4108 476.0104 507.5224 564.3765 577.3793 648.5432 702.7296 713.9129 751.0644 815.6221 829.4360 912.7754 1018.1222 1074.0368 1099.5964 1144.9160 1189.0051 1238.0689 1343.9454 1635.1081 1730.3828 3130.0215 3494.1010
redmass: 22.7547 24.3361 16.8665 21.0822 29.1005 13.2833 20.5020 10.2350 15.1541 12.4584 6.2629 9.0560 3.2925 2.2623 5.9610 14.2072 7.9973 12.1945 8.6382 11.2370 7.3933 8.2413 9.7393 10.7872 9.5861 9.4553 4.6364 3.4060 8.3593 1.0756 1.2677 1.9722 12.0221 13.0745 1.0881 1.0649
irintensity: 0.2586 0.0637 0.2593 0.9423 0.0169 1.1692 0.5122 4.1429 2.4173 5.4106 13.1497 8.9607 40.1427 94.4253 45.5406 27.0788 14.0670 9.9503 66.4215 8.7297 39.4020 71.1146 20.5259 165.4424 137.8695 40.8620 136.1613 33.4802 94.8306 1.8739 3.8680 60.2918 101.0457 327.5443 0.0957 46.2540
temp: 298.150 k
press: 1.00000 atm
elementType: 17 17 17 17 8 8 8 6 6 6 6 6 1 1
symmnumber: 1
zpe: 171397.5 jmol-1
zpe.correction: 0.065282 hartree
zpe.thermalcorrener: 0.077496 hartree
zpe.thermalcorrenthalpy: 0.078440 hartree
zpe.thermalcorrgfe: 0.024906 hartree
zpe.sumelectzpe: -2256.709079 hartree
zpe.sumelectthermal: -2256.696865 hartree
zpe.sumelectthermalent: -2256.695921 hartree
zpe.sumelectthermalfe: -2256.749455 hartree
dipole: -1.3382 3.6735 -0.1850
dipole: 3.9140
quadrupole: -93.6615 -104.1711 -94.8495
quadrupole: 1.1933 4.3585 0.5742
quadrupole: 3.8992 -6.6104 2.7112 1.1933 4.3585 0.5742
hfenergy: -2256.7743607 hartree
pointgroup: C01[X(C5H2Cl4O3)]
dipole: 0.7722899 1.3312331 -0.0513401 debye
dipolederiv: -0.0404433 -0.0056092 -0.0001678 -0.1312513 -0.6805634 0.0852024 0.0164794 0.1263735 0.0350578 -0.2121291 0.0084832 -0.1251643 -0.0215473 -0.0860746 -0.1470935 -0.1232179 -0.0677738 -0.5637941 -0.5612053 0.1433304 -0.1583925 0.2306913 -0.1466048 0.0906309 -0.1184408 0.0444884 -0.295682 -0.5864852 0.0448717 -0.0850427 0.184339 -0.0105285 0.0381918 -0.1645614 0.0222241 0.0275484 -1.2237389 -0.1864722 -0.0818733 -0.2974493 -0.619031 -0.0517426 -0.0794848 0.0440317 -0.3635865 -0.6394362 -0.1990373 0.0040818 -0.2144382 -0.3482356 -0.0150682 -0.2224609 -0.1663714 -0.8606804 -0.6712197 -0.2751946 0.0126685 -0.4340837 -0.9441116 0.0862982 0.0072417 0.071338 -0.286458 0.8613331 0.1240096 -0.0306757 0.4761441 0.3969898 0.1309858 0.1102059 0.1948227 0.7792637 -0.2153431 0.1890165 -0.1032358 0.2191964 1.0902682 -0.1015938 0.0564433 -0.168423 -0.098484 0.7612191 -0.1949115 0.4288288 -0.2580402 0.2478681 0.0254524 0.2248669 0.019436 0.8368653 0.9068607 -0.1253805 0.1902376 -0.2694616 -0.64195 0.0619431 0.2325523 0.0821541 -0.0237456 1.3350267 0.3474664 0.0548474 0.4054945 1.514799 -0.2043022 0.0955326 -0.1756695 0.3512854 -0.0018914 0.0282288 -0.0318933 -0.0015366 -0.0010222 0.0076823 -0.0038291 -0.0258739 0.0010282 0.2874525 0.1011987 -0.0742186 0.1119429 0.2281966 -0.0065866 -0.0313272 -0.0007571 0.4613816 unknown
polarizability: 125.3297862|5.7189478|102.9911446|12.5689235|-3.4530658|72.1581495 unknown
InChI: InChI=1S/C5H2Cl4O3/c6-1-2(7)5(11,4(8)9)12-3(1)10/h4,11H
charge 0 multiplicity 1
14 atoms
Cl -0.447557 2.76036 -0.246081
Cl 1.354985 -0.32358 -2.274321
Cl 3.361405 -0.678217 0.015021
Cl -3.247915 0.571003 -0.405058
O  0.273695 -1.170838 0.545177
O  1.193105 0.738467 1.687983
O  -1.79693 -2.25792 0.368759
C  0.748975 0.241797 0.427191
C  -0.503116 1.014539 0.027854
C  1.89306 0.295232 -0.620966
C  -1.56895 0.179908 -0.026206
C  -1.141255 -1.217481 0.302685
H  2.250085 1.325314 -0.752393
H  1.987912 0.215615 1.983455
