program: Gaussian 09
title: 000006332
version: EM64L-G09RevD.01
frameworkgroup: C1[X(C2H5Br)]
method: RPBEPBE
basis: SDD
operation: Freq
keyword: #pfreq=noraman
keyword: PBEPBE/SDD
title: #p freq=noraman PBEPBE/SDD
converged: NO YES NO NO
title: Mulliken charges:
elementType: Br C C H H H H H
charge: -0.048520 -0.599910 -0.617030 0.275887 0.275887 0.223979 0.244854 0.244854
chargesum: 0.00000
title: Mulliken charges with hydrogens summed into heavy atoms:
elementType: Br C C
charge: -0.048520 -0.048136 0.096657
polarizability: 5.30308619e+01 6.38775078e+00 2.75653339e+01 2.07494467e-04 4.60515034e-05 2.31948445e+01
1716.lowfreq: -42.2948 -13.1014 -12.4611 -0.0003 -0.0002 0.0003 254.4326 271.0427 523.6554
frequency: 254.3980 271.0426 523.6553 768.6313 973.7006 1009.6066 1070.4621 1233.2574 1255.6114 1393.6323 1453.3503 1457.9326 1479.3990 2978.5911 3053.6580 3076.4586 3101.1015 3142.4107
redmass: 1.0752 3.2916 4.2293 1.1126 1.5982 1.1571 2.5115 1.2668 1.2091 1.2039 1.1023 1.0392 1.0484 1.0393 1.0605 1.0901 1.1023 1.1105
irintensity: 0.0730 3.5174 17.9803 12.9154 34.4330 0.0140 0.4337 2.6974 53.6593 16.7984 3.0985 15.0353 8.5983 19.2035 10.4987 31.3427 9.5749 23.5633
temp: 298.150 k
press: 1.00000 atm
elementType: 35 6 6 1 1 1 1 1
symmnumber: 1
zpe: 170449.3 jmol-1
zpe.correction: 0.064921 hartree
zpe.thermalcorrener: 0.069144 hartree
zpe.thermalcorrenthalpy: 0.070088 hartree
zpe.thermalcorrgfe: 0.037395 hartree
zpe.sumelectzpe: -92.409273 hartree
zpe.sumelectthermal: -92.405050 hartree
zpe.sumelectthermalent: -92.404106 hartree
zpe.sumelectthermalfe: -92.436799 hartree
dipole: 2.4672 0.6963 0.0000
dipole: 2.5636
quadrupole: -26.3430 -28.2766 -28.9638
quadrupole: 1.3034 0.0000 0.0000
quadrupole: 1.5182 -0.4155 -1.1027 1.3034 0.0000 0.0000
hfenergy: -92.4741935 hartree
pointgroup: C01 [X(C2H5Br1)]
dipole: -0.9521534 -0.3326817 0.0000066 debye
dipolederiv: -0.5609964 -0.0423442 0.0000028 -0.135382 -0.2025328 0.000001 0.0000027 0.0000004 -0.1592676 0.8313381 0.1870588 -0.000005 0.2091243 0.1955156 -0.0000014 -0.000005 -0.0000013 0.1313085 -0.23387 0.0741671 0.0000017 -0.0552039 -0.0288849 0. 0.0000028 -0.0000006 0.0430488 -0.0510108 -0.0585121 -0.0243426 -0.0358769 -0.0203612 -0.0997997 0.0071117 -0.1082461 -0.0202098 -0.0510108 -0.0585107 0.024343 -0.0358754 -0.020361 0.0998004 -0.0071113 0.1082467 -0.0202099 -0.1559813 -0.0889316 0.0000026 -0.0339849 0.0368063 0.0000009 0.0000023 0.0000013 0.1316988 0.1107655 -0.0064647 -0.0245106 0.0435985 0.0199083 -0.1024605 0.0038986 -0.1165328 -0.0531836 0.1107655 -0.0064626 0.0245081 0.0436002 0.0199097 0.1024593 -0.0039018 0.1165324 -0.0531852 unknown
polarizability: 52.1577641|7.8914483|28.4384317|-0.0002043|-0.0000586|23.1948445 unknown
InChI: InChI=1S/C2H5Br/c1-2-3/h2H2,1H3
charge 0 multiplicity 1
8 atoms
Br 1.611138 0.236159 -0.000015
C  -0.226993 -0.645515 -0.000002
C  -1.336951 0.402673 0.000004
H  -0.228897 -1.27448 -0.903258
H  -0.228885 -1.27448 0.903254
H  -2.319824 -0.109922 0.000015
H  -1.282986 1.045435 0.894812
H  -1.283001 1.045429 -0.894809
