program: Gaussian 09
title: 000060028
version: EM64L-G09RevD.01
frameworkgroup: C1[X(C12H20N2O)]
method: RPBEPBE
basis: SDD
operation: Freq
keyword: #p
keyword: freq=noraman
keyword: PBEPBE/SDD
title: #p freq=noraman PBEPBE/SDD
converged: YES YES NO NO
title: Mulliken charges:
elementType: O N N C C C C C C C C C C C C H H H H H H H H H H H H H H H H H H H H
charge: -0.470323 -0.172962 -0.709974 -0.008371 -0.428860 -0.209568 0.527510 -0.679648 -0.723213 -0.643060 -0.633345 -0.449207 0.505373 -0.188252 -0.439550 0.212805 0.244010 0.195615 0.191014 0.207974 0.218274 0.229448 0.228582 0.216957 0.219758 0.248930 0.235715 0.200484 0.216283 0.273384 0.354789 0.213985 0.212687 0.300962 0.301793
chargesum: 0.00000
title: Mulliken charges with hydrogens summed into heavy atoms:
elementType: O N N C C C C C C C C C C C C
charge: -0.115535 -0.172962 -0.107219 0.187244 0.027956 -0.018555 0.527510 -0.023952 -0.057916 0.042069 -0.417061 -0.175822 0.505373 0.025733 -0.226863
polarizability: 1.96916079e+02 -3.16829362e+00 1.52211450e+02 -1.40779593e+01 3.90435532e+00 1.01522909e+02
1716.lowfreq: -11.0890 -0.0009 -0.0007 -0.0001 5.0333 6.1926 27.4156 36.3062 49.8359
frequency: 27.0846 36.1318 49.8346 66.3143 81.5956 171.3493 189.9103 202.5382 216.7838 220.7053 239.3506 266.6906 318.5187 329.0506 332.8994 337.2748 363.1584 390.6165 407.7158 416.0123 442.9829 458.9352 487.9294 523.1456 547.1227 611.0876 629.1392 701.4227 724.0587 742.2027 783.1424 799.3355 858.5036 863.2754 882.0609 890.8858 915.7689 938.9419 948.7352 971.6198 976.1898 982.2589 1015.2960 1018.4877 1055.5952 1079.2442 1095.1286 1104.0759 1125.8526 1153.4359 1168.9921 1170.8062 1180.3765 1210.5590 1256.3527 1269.3012 1288.7287 1309.5694 1318.7477 1323.7153 1326.4248 1352.9389 1379.2432 1394.0611 1396.2502 1398.3329 1434.0546 1452.8299 1462.3344 1465.1935 1469.2057 1478.7925 1483.6223 1483.9510 1491.8918 1501.6363 1597.9311 1626.6032 1640.5216 2870.2203 2897.0762 2906.2218 2940.4582 2982.8644 2987.1358 3046.5703 3077.3624 3082.1067 3085.7438 3087.8384 3093.1203 3095.1120 3101.8039 3112.8831 3138.1922 3175.5389 3179.2777 3569.3871 3710.4791
redmass: 3.6335 3.5652 2.7969 4.0609 3.4373 3.4074 4.2670 1.0896 1.6872 2.1762 2.6284 1.3684 3.8882 1.2643 3.3273 1.9803 1.0359 2.0439 2.5716 2.2313 3.0761 2.7899 2.4083 5.7543 3.0349 4.2175 4.6296 1.8656 2.9037 1.1990 2.6634 1.7384 3.0356 1.7898 2.0047 1.6327 1.1672 2.4106 1.4807 1.6886 1.7892 4.7386 2.6197 1.7433 2.3790 1.9653 1.4232 1.6037 1.7937 1.7040 1.4426 1.4977 1.5620 2.1145 1.5246 1.3148 1.2942 1.2807 1.7021 1.7592 1.3981 1.2934 1.2302 3.0183 1.5263 1.5542 1.1474 1.1373 2.3530 1.1339 1.0625 1.0591 1.0655 1.0582 2.7776 1.0502 6.3176 3.6562 1.3374 1.0827 1.0541 1.0822 1.0701 1.0360 1.0365 1.0780 1.0998 1.0947 1.0988 1.0984 1.0968 1.0905 1.0990 1.0868 1.0943 1.0948 1.0633 1.0447 1.1040
irintensity: 0.4793 0.4249 0.2347 2.2770 1.8092 1.4435 0.2374 0.1274 7.4343 3.2998 1.0368 0.6935 4.5991 315.7033 6.7557 1.4533 0.0321 0.3479 0.6290 0.2679 4.1466 1.9592 1.3986 0.1993 4.2838 2.0680 5.3284 16.8211 10.3829 101.0012 25.1611 48.3547 22.3098 29.3783 9.1054 4.7998 3.8554 10.8065 0.2972 18.7389 7.2465 7.7996 49.7589 14.7648 13.9689 17.2405 25.2929 2.5303 2.8518 51.6939 5.5487 8.8572 3.6032 25.9343 18.7028 4.8888 24.2668 24.6670 20.0234 14.5853 45.5888 8.8640 16.6103 32.0296 22.4724 54.8952 13.4869 11.8211 29.6107 2.9104 4.5869 2.4837 40.8749 11.6740 52.9667 5.7107 21.4552 73.7828 261.7076 64.3892 100.3568 60.9876 64.3825 25.6536 20.0640 28.5576 0.6754 4.5984 76.0741 44.0161 43.5685 26.7124 22.4816 17.2935 33.6847 5.9472 222.3861 54.7153 17.6133
temp: 298.150 k
press: 1.00000 atm
elementType: 8 7 7 6 6 6 6 6 6 6 6 6 6 6 6 1 1 1 1 1 1 1 1 1 1 1 1 1 1 1 1 1 1 1 1
symmnumber: 1
zpe: 792297.2 jmol-1
zpe.correction: 0.301770 hartree
zpe.thermalcorrener: 0.318234 hartree
zpe.thermalcorrenthalpy: 0.319178 hartree
zpe.thermalcorrgfe: 0.257362 hartree
zpe.sumelectzpe: -652.812885 hartree
zpe.sumelectthermal: -652.796421 hartree
zpe.sumelectthermalent: -652.795477 hartree
zpe.sumelectthermalfe: -652.857294 hartree
dipole: -0.7366 -3.0534 -3.0446
dipole: 4.3744
quadrupole: -70.0855 -83.4129 -100.6095
quadrupole: -4.7658 -4.1153 -1.8485
quadrupole: 14.6172 1.2897 -15.9069 -4.7658 -4.1153 -1.8485
hfenergy: -653.1146553 hartree
pointgroup: C01 [X(C12H20N2O1)]
dipole: -0.3249414 -1.4291451 -0.9021612 debye
polarizability: 195.9827128|-6.5888712|151.5785716|-15.8925652|-6.8365363|103.0891537 unknown
InChI: InChI=1S/C12H20N2O/c1-9(2)14(3)8-12(15)10-5-4-6-11(13)7-10/h4-7,9,12,15H,8,13H2,1-3H3
charge 0 multiplicity 1
35 atoms
O  -0.771125 0.9673 1.581414
N  -2.543648 -0.5140 0.240387
N  4.325216 -1.712368 -0.595288
C  -3.501268 -0.00924 -0.807481
C  -1.132683 -0.616516 -0.232786
C  -0.170021 -0.191313 0.930718
C  1.218493 0.131264 0.398276
C  -3.221187 1.480443 -1.115982
C  -4.97126 -0.163475 -0.360911
C  -2.95443 -1.758765 0.936303
C  2.136867 -0.920451 0.179998
C  1.574448 1.462078 0.070121
C  3.420587 -0.666289 -0.380726
C  2.85006 1.71822 -0.481176
C  3.768843 0.674394 -0.714322
H  -0.878793 -1.638412 -0.591795
H  -0.978408 0.081646 -1.070863
H  -3.364962 -0.600732 -1.747251
H  -0.092974 -1.033858 1.656293
H  -3.878006 1.823652 -1.936116
H  -3.425158 2.09624 -0.221071
H  -2.178188 1.668211 -1.421851
H  -5.282279 -1.218488 -0.271571
H  -5.629285 0.31492 -1.107993
H  -5.137262 0.338895 0.610343
H  -3.892582 -1.60753 1.492559
H  -2.174292 -2.027404 1.669686
H  -3.085709 -2.62165 0.241052
H  1.865933 -1.949077 0.457811
H  0.865753 2.266377 0.283851
H  -1.760068 0.812309 1.423217
H  3.138546 2.747003 -0.728051
H  4.756748 0.890328 -1.140664
H  4.091883 -2.665234 -0.334011
H  5.25121 -1.527979 -0.96842
