program: Gaussian 09
title: 000002182
version: EM64L-G09RevD.01
frameworkgroup: C1[X(C10H7Cl2N3O)]
method: RPBEPBE
basis: SDD
operation: Freq
keyword: #p
keyword: freq=noraman
keyword: PBEPBE/SDD
title: #p freq=noraman PBEPBE/SDD
converged: NO YES NO YES
title: Mulliken charges:
elementType: Cl Cl O N N N C C C C C C C C C C H H H H H H H
charge: 0.007858 0.004325 -0.188598 -0.211273 -0.403904 -0.109583 -0.439007 0.400972 0.187669 -0.460591 0.311696 0.000512 -0.229228 -0.427198 -0.160337 -0.194636 0.260745 0.260755 0.262665 0.262752 0.351406 0.247966 0.265036
chargesum: 0.00000
title: Mulliken charges with hydrogens summed into heavy atoms:
elementType: Cl Cl O N N N C C C C C C C C C C
charge: 0.007858 0.004325 -0.188598 -0.211273 -0.052498 -0.109583 0.082493 0.400972 0.187669 0.064826 0.311696 0.000512 -0.229228 -0.179233 -0.160337 0.070400
polarizability: 2.56794435e+02 -4.47351986e+00 1.53927797e+02 3.57840652e-03 1.73832510e-03 6.34799932e+01
1716.lowfreq: 0.0012 0.0020 0.0028 4.3501 9.8568 10.2520 29.5562 73.3704 95.6528
frequency: 29.5502 73.3678 95.6385 117.7842 141.0009 190.9159 192.3357 231.9802 242.0297 262.1072 288.7891 339.4209 399.7329 449.4823 462.8859 497.4950 530.8336 542.8051 576.4433 578.2895 595.3529 641.5747 681.3642 691.5406 711.0492 763.3935 790.9622 810.8973 820.4748 855.8513 924.0865 938.4436 962.1589 1006.5247 1090.5558 1125.1246 1142.9195 1145.7526 1174.9691 1192.7614 1226.3745 1231.0706 1233.2990 1278.5404 1331.9800 1350.4285 1388.4708 1423.0864 1440.5486 1466.3516 1480.2614 1543.3577 1557.4374 1595.6339 1611.0457 1677.3333 2945.0625 2978.7881 2998.3108 3059.6453 3146.4425 3177.2673 3578.0555
redmass: 6.5228 6.2039 4.9839 4.7337 12.1252 3.5813 30.4988 7.0150 3.6278 10.8690 15.5698 5.8992 9.2653 6.6209 7.7979 3.7578 6.5323 2.4105 4.3040 1.2759 6.0532 7.0537 8.3365 8.7124 4.6615 6.2774 6.7975 1.4464 5.6893 4.4702 7.0525 1.3563 2.0088 1.6749 9.2623 2.3225 3.4380 1.1073 2.6055 2.3227 1.0790 2.5927 1.5399 2.6789 2.0248 3.6872 4.4315 3.2187 1.1762 2.7229 1.3461 3.0150 4.6902 6.1344 7.6510 11.1436 1.0575 1.1036 1.0574 1.1060 1.0901 1.0961 1.0779
irintensity: 4.3474 1.2679 1.9119 3.0423 3.1435 14.7089 0.0059 5.6157 0.0647 3.7497 1.0483 1.0841 0.2800 6.9287 4.3465 2.5830 18.7174 10.6892 0.0961 83.7283 19.1421 6.6562 5.0413 24.9253 0.0176 0.3176 11.7648 62.4300 47.9178 6.4172 9.2292 0.3389 0.6822 0.0601 229.8364 9.2013 11.4414 3.7698 47.6656 2.9053 1.2667 40.8131 28.2444 12.9354 17.7040 31.7418 46.0584 39.1742 27.4128 139.3178 20.4298 225.0326 1190.1497 345.4934 97.2733 64.3321 27.2427 17.0982 16.6547 10.1252 5.9771 1.1728 77.2179
temp: 298.150 k
press: 1.00000 atm
elementType: 17 17 8 7 7 7 6 6 6 6 6 6 6 6 6 6 1 1 1 1 1 1 1
symmnumber: 1
zpe: 412875.8 jmol-1
zpe.correction: 0.157256 hartree
zpe.thermalcorrener: 0.170541 hartree
zpe.thermalcorrenthalpy: 0.171485 hartree
zpe.thermalcorrgfe: 0.116023 hartree
zpe.sumelectzpe: -1543.745218 hartree
zpe.sumelectthermal: -1543.731933 hartree
zpe.sumelectthermalent: -1543.730989 hartree
zpe.sumelectthermalfe: -1543.786451 hartree
dipole: -5.4059 0.4708 -0.0007
dipole: 5.4263
quadrupole: -158.2351 -91.0983 -106.0869
quadrupole: -12.2219 -0.0069 0.0006
quadrupole: -39.7617 27.3751 12.3865 -12.2219 -0.0069 0.0006
hfenergy: -1543.9024737 hartree
pointgroup: C01 [X(C10H7Cl2N3O1)]
dipole: 2.1344135 0.0445438 0.000276 debye
dipolederiv: -0.1028269 0.0758871 -0.0000051 0.1784234 -0.6151036 0.0000033 0.0000036 0.0000036 -0.0237257 -0.8035153 0.1335766 -0.0000079 0.2052807 -0.0896037 0.0000031 -0.0000049 0.0000052 -0.0209723 -1.6744859 -0.0556872 0.0003421 -0.2290252 -0.4280277 -0.0000042 -0.0012841 -0.0001487 -0.3430489 -0.723819 0.1084914 0.0000448 0.3003919 -0.8337512 -0.000043 -0.000123 0.0001018 -0.2713811 -2.1307418 -0.1467752 0.0000282 -0.364562 -0.4688651 0.0000242 0.0003536 0.000101 -0.3305584 -2.1317946 -0.1112645 0.0000915 -0.7018863 -0.6251984 -0.0001998 0.0001126 0.000086 -0.3112773 0.4906704 -0.2585537 -0.0000695 -0.3093924 0.2178767 0.0000728 -0.000107 0.0000038 0.3734899 -0.2539044 0.0778166 0.0000266 0.5390666 -0.193493 -0.0000022 0.0000684 0.0000448 -0.01789 2.5582991 0.104048 -0.0001761 0.3049777 1.1028668 0.0000022 0.0000548 0.0000043 0.1992776 0.1366265 0.4362639 -0.0000449 0.3943825 -0.1563599 -0.0000678 0.0000278 -0.0005229 0.3405539 1.5590389 -0.1890302 -0.0000029 -0.6279529 0.0629648 0.0000054 -0.0000181 -0.0000272 0.0900584 2.2093963 0.0837838 -0.0002505 1.0172827 0.8580503 0.0000768 0.0008961 0.0003072 0.1350431 0.0487781 -0.0933026 0.000006 -0.2484716 0.9429289 0.0000089 -0.0000191 -0.0000129 -0.0479614 -0.3858696 0.1061154 0.0000156 -0.1452274 0.0682276 -0.0000012 -0.0000181 -0.000014 -0.1888543 0.9592355 -0.1758593 0.000016 -0.3139802 -0.204757 -0.0000148 0.0000013 -0.0000094 -0.0758537 -0.0710699 -0.0867386 -0.000011 0.0978152 0.0910081 -0.000002 0.0000065 -0.0000022 -0.0731912 -0.0159842 0.01803 -0.0030472 0.0257472 -0.0210846 -0.0721232 0.023065 -0.1077435 -0.0370143 -0.0159183 0.0180626 0.0030225 0.0257827 -0.0211058 0.0721112 -0.0230299 0.107691 -0.0368877 0.0621492 -0.0134103 -0.0143802 -0.0552703 0.0339253 0.0684373 0.0295382 0.1037075 -0.0215171 0.0620614 -0.013369 0.0143946 -0.0551913 0.034013 -0.0682995 -0.0295593 -0.1035702 -0.0215131 0.1506293 -0.0350458 0.0000102 -0.0297867 0.2533013 0.0000051 0.0000285 -0.0000142 0.3450901 0.0533605 0.0747363 -0.0000034 0.0470273 -0.0530227 0.0000045 0.0000035 0.0000026 0.1736612 0.0196848 -0.0577752 0.0000006 -0.0554315 0.04521 0.0000029 0.0000035 0.0000064 0.1644726 unknown
polarizability: 256.9357814|-2.3350808|153.7864504|0.003456|-0.0019705|63.4799932 unknown
InChI: InChI=1S/C10H7Cl2N3O/c11-6-1-2-7-5(9(6)12)3-15-4-8(16)14-10(15)13-7/h1-2,13H,3-4H2
charge 0 multiplicity 1
23 atoms
Cl 2.548764 -2.567069 0.000058
Cl 5.015491 -0.428186 0.000086
O  -5.096428 -0.187099 -0.000468
N  -1.562701 -0.691772 0.000254
N  -0.70383 1.521712 -0.000018
N  -3.062229 1.082939 0.000203
C  -0.260499 -1.366521 -0.00008
C  0.879116 -0.349843 0.000021
C  -1.781859 0.669928 0.000202
C  -2.876586 -1.347783 0.000228
C  0.627516 1.053086 0.000007
C  -3.84627 -0.105094 0.00085
C  2.22329 -0.782006 0.000053
C  1.701142 1.976464 -0.000008
C  3.297404 0.134445 0.000063
C  3.030197 1.517994 0.000025
H  -0.173154 -2.027205 -0.887965
H  -0.172952 -2.027644 0.887444
H  -3.042608 -1.967831 0.90068
H  -3.042816 -1.967326 -0.900537
H  -0.908927 2.521004 -0.000066
H  1.499381 3.052668 -0.000042
H  3.863059 2.226441 0.000011
