program: Gaussian 09
title: 000060038
version: EM64L-G09RevD.01
frameworkgroup: C1[X(C22H29N3O2S2)]
method: RPBEPBE
basis: SDD
operation: Freq
keyword: #p
keyword: freq=noraman
keyword: PBEPBE/SDD
title: #p freq=noraman PBEPBE/SDD
converged: YES YES NO NO
title: Mulliken charges:
elementType: S S O O N N N C C C C C C C C C C C C C C C C C C C C C C H H H H H H H H H H H H H H H H H H H H H H H H H H H H H
charge: 0.186688 -0.048144 -0.269050 -0.267527 0.014365 -0.398589 -0.128022 -0.362790 -0.376463 -0.419334 -0.859719 0.203472 -0.638045 -0.638586 0.417372 0.245750 -0.306685 -0.472000 -0.367215 -0.354934 0.325951 0.321598 -0.363839 -0.326543 -0.353613 -0.354055 -0.240634 -0.686811 -0.538240 0.217157 0.261921 0.251582 0.230907 0.322207 0.320493 0.251384 0.209730 0.223448 0.247379 0.216414 0.224006 0.315072 0.319491 0.232161 0.251230 0.239886 0.245982 0.236974 0.246963 0.239985 0.204847 0.202828 0.204041 0.232074 0.231055 0.217882 0.242111 0.216433
chargesum: 0.00000
title: Mulliken charges with hydrogens summed into heavy atoms:
elementType: S S O O N N N C C C C C C C C C C C C C C C C C C C C C C
charge: 0.186688 -0.048144 -0.269050 -0.267527 0.014365 -0.083517 -0.128022 0.116289 0.106026 -0.419334 -0.217020 0.203472 0.046517 0.049213 0.417372 0.245750 0.012805 -0.239840 -0.115985 -0.115047 0.325951 0.321598 -0.117857 -0.089570 -0.106649 -0.114070 0.167042 -0.019642 0.138186
polarizability: 5.11414773e+02 -1.05452658e+01 3.53617687e+02 8.13323568e+00 -1.72475185e+01 2.05286138e+02
1716.lowfreq: -2.8082 -0.0014 -0.0009 0.0008 2.6026 5.7952 14.7637 21.3979 23.3451
frequency: 14.7247 21.3826 23.3376 27.5190 38.2091 41.8578 53.2852 59.5820 69.4506 71.6743 77.7420 84.3998 104.7211 112.5449 114.2311 132.5160 138.5174 146.0016 162.9790 175.9163 190.6156 210.4102 214.4770 236.2715 244.3461 253.2416 269.9170 282.6995 294.7343 334.4957 338.2122 351.6879 362.9501 366.0957 383.3677 389.5860 416.8880 417.4466 418.7466 437.3561 465.2586 470.4845 502.2111 515.4587 528.0827 533.6512 554.4469 561.9191 581.5018 622.1656 630.8006 657.7037 701.1151 711.1198 723.0858 724.9917 735.4828 757.7215 764.4450 780.9170 790.1377 799.4348 806.7323 812.9971 828.7801 830.8188 838.5531 850.2511 888.8183 902.7540 908.8943 923.8340 924.9580 954.7099 957.5846 960.4337 988.6007 989.7534 997.8416 1001.6609 1007.8509 1039.8947 1068.1214 1077.3044 1095.2061 1106.2893 1112.6553 1113.0382 1117.5871 1136.1556 1146.0555 1156.0126 1168.7598 1171.6300 1179.5458 1186.9815 1193.1902 1214.7534 1219.0314 1258.4907 1261.4348 1263.3728 1269.6606 1290.9467 1293.0669 1302.5797 1337.3840 1339.3897 1347.1723 1350.7319 1370.1712 1378.0160 1386.6657 1388.9261 1399.1138 1419.3613 1424.2086 1426.4677 1426.9398 1437.2599 1460.6961 1463.4469 1466.6114 1467.9867 1469.5212 1474.5388 1476.7913 1480.6694 1483.6359 1484.3758 1494.9081 1502.8781 1504.2451 1548.7439 1564.8343 1600.3978 1615.5618 1628.2772 1629.5263 2946.0395 2952.0682 2989.6596 2990.9590 2995.9599 3000.9444 3001.6642 3007.8538 3011.5766 3036.5329 3062.2942 3073.0729 3088.2358 3089.6078 3093.1977 3103.9577 3104.6233 3105.2740 3118.6786 3119.3668 3120.4609 3125.4573 3146.0212 3157.8684 3157.9989 3160.6844 3168.8059 3186.9672 3333.4639
redmass: 4.5287 4.7312 4.5632 3.8232 3.9125 3.5178 5.5248 4.1934 3.5559 4.2091 3.4473 4.2703 4.2317 3.8036 2.2279 3.8905 4.6895 5.8014 4.4774 4.4652 2.8054 1.0339 1.3100 2.1996 1.3049 1.6699 3.8566 3.3369 3.7997 3.8204 4.1612 3.9516 4.1579 4.4935 4.8602 5.8082 3.3750 3.2024 3.1642 3.7386 4.3460 4.2693 3.7585 3.4075 2.5541 3.3236 5.8504 4.6292 5.1723 6.5422 7.0010 4.9257 4.9925 4.6827 3.1059 3.8156 1.3268 5.0670 1.6939 1.1507 4.4534 1.3497 1.3743 1.6909 1.7442 1.3502 2.1389 1.4841 2.9188 3.1659 2.4758 1.3676 1.3760 4.0131 1.5316 2.7623 2.2128 2.2659 2.5525 2.6779 2.7777 2.8793 2.2690 1.8770 1.8749 1.3856 1.3095 1.2607 1.9733 1.4419 1.8843 1.3367 1.5684 1.2264 1.3281 2.0242 2.6539 2.7929 3.0087 1.6834 1.1414 1.6831 1.3781 1.2314 1.3046 1.3253 1.2690 2.8115 4.0375 1.2729 1.4632 5.0473 1.2079 1.2031 1.2770 1.3898 2.5515 3.1708 2.0262 1.1845 1.0401 1.0964 1.0505 1.0508 1.0601 1.1076 1.1751 1.0571 1.0741 1.3823 1.4200 1.5396 1.8586 2.6973 7.2824 3.8155 5.7446 6.3657 3.8193 1.0552 1.0333 1.0358 1.0356 1.0361 1.0648 1.1072 1.0612 1.0613 1.1035 1.1027 1.1005 1.0998 1.0998 1.0989 1.1017 1.1012 1.1018 1.0912 1.0985 1.0969 1.0887 1.0877 1.0939 1.0905 1.0934 1.0972 1.0956 1.0798
irintensity: 1.0861 0.3457 0.3210 0.8570 0.6393 1.5224 1.6462 0.0476 0.1790 1.1203 0.1714 1.9210 4.1231 3.3156 1.6397 1.3582 1.5105 0.9837 2.1073 2.0687 0.8027 0.1328 1.1996 3.6695 1.1291 0.5772 3.9265 6.4390 2.5020 1.1733 1.1471 10.6539 17.4764 2.4715 0.5894 0.6036 5.2134 3.2330 4.7488 9.9084 5.1363 6.6079 12.5511 18.0096 18.9079 5.9909 17.3680 2.9875 1.6161 7.1680 0.5195 17.3881 8.7135 21.0319 7.9225 0.5378 22.4649 23.2216 7.6619 2.2353 2.6252 41.2576 55.6382 36.3077 34.8804 0.4983 38.0528 58.6329 46.9917 42.7186 17.5490 6.2285 2.1140 2.9848 7.0643 19.7678 33.0403 26.0203 8.2310 26.0751 20.2055 89.2742 16.0086 23.9961 12.4735 12.2381 16.3488 0.2469 11.1438 4.1960 40.4365 2.1676 18.1359 100.8883 162.9861 47.0178 92.4074 476.4244 58.8522 18.7090 0.1459 55.8956 29.9542 16.7177 1.9462 1.9371 11.4768 5.3126 10.8114 24.3837 51.2769 60.5809 4.4994 36.2415 43.2194 40.5469 26.0032 31.5304 95.6969 30.1596 11.2179 32.4077 12.8086 16.4855 3.7624 200.5783 88.0741 6.8428 32.4186 184.2702 140.0886 160.4978 97.3001 248.3698 1.2039 361.1710 8.0179 67.2514 497.9376 40.8269 100.0781 26.3497 26.3745 35.7918 7.1013 40.6825 31.9029 37.1212 54.2969 7.4712 3.5831 27.0090 34.4400 30.0416 11.1119 34.9359 43.0368 39.1254 4.1467 8.9667 24.2690 10.0658 18.8207 6.8032 15.7233 9.1170 12.7250 415.2774
temp: 298.150 k
press: 1.00000 atm
elementType: 16 16 8 8 7 7 7 6 6 6 6 6 6 6 6 6 6 6 6 6 6 6 6 6 6 6 6 6 6 1 1 1 1 1 1 1 1 1 1 1 1 1 1 1 1 1 1 1 1 1 1 1 1 1 1 1 1 1
symmnumber: 1
zpe: 1236416.0 jmol-1
zpe.correction: 0.470926 hartree
zpe.thermalcorrener: 0.502178 hartree
zpe.thermalcorrenthalpy: 0.503123 hartree
zpe.thermalcorrgfe: 0.404472 hartree
zpe.sumelectzpe: -1964.381156 hartree
zpe.sumelectthermal: -1964.349904 hartree
zpe.sumelectthermalent: -1964.348960 hartree
zpe.sumelectthermalfe: -1964.447610 hartree
dipole: 1.5465 7.4061 -2.8220
dipole: 8.0750
quadrupole: -155.4819 -170.4077 -190.4082
quadrupole: -4.7658 1.8570 -13.3823
quadrupole: 16.6174 1.6916 -18.3089 -4.7658 1.8570 -13.3823
hfenergy: -1964.8520823 hartree
pointgroup: C01 [X(C22H29N3O2S2)]
dipole: -1.0412474 -2.8503851 0.9402863 debye
polarizability: 460.851138|-65.8096943|394.2245617|-55.4769955|19.2235244|215.2428983 unknown
InChI: InChI=1S/C22H29N3O2S2/c1-5-25(6-2)22(28)29-16-21(23-17-8-12-19(26-4)13-9-17)24-18-10-14-20(15-11-18)27-7-3/h8-15,23H,5-7,16H2,1-4H3
charge 0 multiplicity 1
58 atoms
S  -1.650371 -1.943481 -0.304759
S  0.194507 -3.466179 -2.358131
O  -4.446595 4.511294 0.841906
O  6.699543 0.850524 0.074783
N  -1.108005 -4.597457 -0.239399
N  1.343437 -0.477836 -1.214975
N  0.107643 1.432545 -0.548531
C  -0.546153 -5.922459 -0.635433
C  -1.978903 -4.608135 0.9711
C  -0.817944 -3.474741 -0.961466
C  -1.063773 -0.589964 -1.502364
C  0.148797 0.203197 -1.022107
C  0.821464 -6.192997 0.022447
C  -3.465584 -4.849145 0.634603
C  2.672196 -0.110995 -0.879316
C  -1.082218 2.117214 -0.208393
C  3.027264 1.127206 -0.27104
C  3.698084 -1.047158 -1.177621
C  -1.258619 3.449738 -0.688749
C  -2.065393 1.592498 0.677004
C  -3.364094 3.662609 0.540839
C  5.390343 0.46212 -0.27072
C  4.3734 1.40064 0.028294
C  5.048275 -0.770846 -0.879709
C  -2.385767 4.206075 -0.331624
C  -3.195486 2.353801 1.054422
C  -5.474489 4.000737 1.765335
C  -6.517406 5.104807 1.92175
C  7.7767 -0.092696 -0.221301
H  -1.285614 -6.689062 -0.338738
H  -0.449566 -5.936532 -1.733667
H  -1.852679 -3.655605 1.515053
H  -1.598072 -5.40798 1.631804
H  -1.94078 0.064579 -1.608636
H  -0.854507 -1.116144 -2.452321
H  1.557919 -5.441193 -0.307074
H  0.755374 -6.164098 1.125229
H  1.188654 -7.192303 -0.273226
H  -3.860769 -4.036784 0.00198
H  -3.60482 -5.806915 0.101917
H  -4.060306 -4.885343 1.565202
H  1.233192 -1.409694 -1.646236
H  2.238878 1.848808 -0.051365
H  3.437252 -2.003383 -1.648526
H  -0.491528 3.87119 -1.346202
H  -1.921064 0.595412 1.110018
H  4.658144 2.34832 0.496082
H  5.811231 -1.515552 -1.125408
H  -2.527087 5.22437 -0.707264
H  -3.920202 1.919604 1.749971
H  -5.005681 3.749517 2.739916
H  -5.926579 3.077731 1.345031
H  -7.319166 4.777755 2.608756
H  -6.055716 6.019478 2.331155
H  -6.970029 5.352404 0.94639
H  7.85059 -0.296279 -1.308154
H  8.696904 0.401076 0.124873
H  7.639873 -1.048195 0.32329
