program: Gaussian 09
title: 000059984
version: EM64L-G09RevD.01
frameworkgroup: C1[X(C20H32N2O3)]
method: RPBEPBE
basis: SDD
operation: Freq
keyword: #p
keyword: freq=noraman
keyword: PBEPBE/SDD
title: #p freq=noraman PBEPBE/SDD
converged: NO YES NO NO
title: Mulliken charges:
elementType: O O O N N C C C C C C C C C C C C C C C C C C C C H H H H H H H H H H H H H H H H H H H H H H H H H H H H H H H H
charge: -0.320036 -0.279941 -0.320338 -0.066518 -0.450270 0.049604 -0.440568 -0.448171 -0.377259 -0.388252 -0.327759 -0.371446 -0.347474 0.240177 -0.693569 0.273220 0.203747 -0.386869 -0.333838 -0.276872 -0.340914 -0.323302 -0.235422 -0.255896 -0.686057 0.229722 0.231542 0.213799 0.218754 0.205769 0.215477 0.177176 0.173363 0.217436 0.198557 0.171444 0.207244 0.193567 0.192534 0.192469 0.209458 0.215738 0.211848 0.362176 0.210679 0.210784 0.206497 0.206158 0.301126 0.195284 0.194611 0.246628 0.225640 0.223684 0.213099 0.212738 0.219023
chargesum: 0.00000
title: Mulliken charges with hydrogens summed into heavy atoms:
elementType: O O O N N C C C C C C C C C C C C C C C C C C C C
charge: -0.320036 -0.279941 -0.320338 -0.066518 -0.088094 0.279326 0.004772 -0.023649 0.015394 0.002547 0.042243 0.029365 0.037528 0.240177 -0.056525 0.273220 0.203747 0.034593 -0.032711 0.135782 0.048981 -0.076674 -0.009782 -0.032212 -0.041196
polarizability: 3.30968255e+02 1.39465281e+01 2.57554400e+02 1.29227837e+01 1.01905202e+01 1.70961843e+02
1716.lowfreq: -5.8126 -5.3939 -1.9860 -0.0013 -0.0005 0.0012 8.9902 17.7838 26.8857
frequency: 8.7401 17.7544 26.8142 32.1157 40.9701 41.5518 48.7331 63.7306 68.4389 86.4598 96.4106 104.8912 108.8431 125.0511 137.5383 156.2930 179.7060 202.8792 206.9970 217.2872 226.3381 229.3817 233.8322 258.3072 271.5406 295.4109 304.1876 341.5566 344.0448 351.0404 403.4764 440.7279 445.6885 454.7013 471.8480 481.0049 512.8362 558.2127 577.1933 590.5110 628.9741 686.8552 709.5336 723.6574 735.5765 741.9279 745.3484 753.7644 758.1408 783.7549 794.9499 812.1697 814.8953 825.9707 852.9417 861.9002 897.6523 903.9900 919.3872 925.1873 932.2177 939.9623 945.2177 975.1770 978.4814 978.7912 989.1067 1005.6897 1026.1126 1041.9828 1042.6597 1043.5545 1076.7856 1082.3785 1098.2694 1104.7363 1107.6884 1124.0093 1125.6125 1133.4525 1138.5721 1146.9521 1147.2133 1167.3275 1173.3739 1193.0515 1196.3627 1213.1596 1223.2990 1241.8156 1254.1446 1259.4964 1272.1303 1272.4707 1277.5462 1278.1568 1284.5567 1288.2540 1294.0033 1305.6370 1307.3793 1315.1035 1332.4476 1345.3731 1345.4375 1349.8902 1356.3002 1372.2511 1376.9545 1387.2445 1391.9579 1394.7246 1399.0998 1441.6588 1451.1717 1460.2618 1463.0775 1466.4584 1467.4892 1469.5921 1470.3944 1474.3554 1474.8283 1476.8617 1477.2247 1482.1345 1484.3161 1489.7923 1492.1500 1521.4877 1603.7052 1611.3671 1652.1711 2816.7781 2820.5534 2837.6903 2949.6768 2962.8011 2968.0995 2972.2371 2976.1957 2977.3392 2992.9252 2998.9879 3003.3372 3004.8363 3006.6276 3006.6800 3010.4909 3012.7619 3030.5085 3044.5970 3056.1919 3058.4763 3069.5656 3071.5519 3071.8898 3074.8312 3077.2055 3078.2898 3135.1202 3152.8899 3168.7730 3188.8286 3518.1102
redmass: 3.5001 4.2634 2.8482 3.2815 2.9652 2.2740 1.8591 4.2448 3.7754 5.0080 3.9316 3.0167 3.6742 2.6910 2.0330 3.8631 4.1141 5.1367 3.5941 2.2591 1.4031 1.1312 2.1058 3.0747 3.4366 4.5277 4.5871 4.7999 3.9930 2.1054 3.2922 2.7250 2.4289 3.2776 4.8078 3.0172 5.0134 3.8783 3.8777 6.1230 3.4804 5.0867 7.5933 2.5412 1.0788 1.1547 1.4545 1.2744 3.6609 6.0273 1.1845 1.1357 1.4559 3.5014 1.3715 2.9781 1.7716 1.8026 3.6101 1.6359 1.3235 1.1672 1.3973 6.0859 1.5833 1.7194 2.1390 4.7118 2.8351 3.4881 2.1975 2.3388 2.3176 2.2097 2.2083 2.5129 2.0949 2.5990 2.2854 1.7008 2.3545 1.4588 1.5048 2.7586 1.0650 2.0242 2.6386 1.3651 1.3009 1.3612 1.8985 1.3846 1.3561 1.3160 1.3071 1.1733 1.0748 1.1029 1.2431 1.3939 1.5097 1.2951 1.2933 1.4731 1.5064 1.4806 1.6095 1.3962 1.5170 1.2358 1.2480 1.4090 4.9464 2.4924 1.0904 1.0798 1.0955 1.5721 1.1117 1.0696 1.1165 1.0843 1.1478 1.0444 1.0443 1.0766 1.1223 1.0912 1.1235 2.7848 5.8443 6.5317 9.2997 1.0715 1.0715 1.0696 1.0553 1.0585 1.0588 1.0375 1.0365 1.0604 1.0591 1.0850 1.0774 1.0620 1.0983 1.1048 1.0677 1.1024 1.0858 1.1025 1.0871 1.1046 1.1007 1.1036 1.0995 1.1015 1.0995 1.1038 1.0856 1.0913 1.0972 1.0956 1.0758
irintensity: 0.1757 0.4146 0.3418 0.0240 0.3465 0.1412 0.1728 1.1250 0.3426 1.8850 0.3543 1.4684 1.0572 1.5950 3.2240 0.0590 0.1718 1.5420 0.1006 2.1181 1.0945 0.1351 0.4732 9.6931 6.5914 0.1424 2.4193 3.3891 9.5713 3.5703 0.8444 2.0974 5.5447 7.6334 5.0359 0.8567 1.1844 0.9293 3.1151 4.2939 3.2991 0.1585 14.6731 5.5576 7.5964 13.3550 18.6172 171.2218 9.9334 9.2585 1.0255 1.4232 0.7826 5.0216 0.8400 1.5082 10.5700 20.9292 4.9920 4.6963 7.1337 0.0532 10.3415 116.1940 2.3743 8.1067 57.1145 300.3892 159.5852 20.7379 11.3432 16.2782 2.8654 8.2345 14.4660 7.0773 68.6191 12.1749 2.0438 16.9362 10.4036 1.9431 5.2604 449.1899 5.4205 29.3633 124.2656 0.0016 2.3965 10.7095 121.2811 2.0543 11.8960 7.7814 7.9913 0.5970 0.1682 1.2342 14.4537 19.6566 18.5212 1.4371 10.2209 5.5865 0.1927 53.8854 21.9357 1.3288 34.2115 9.8124 15.9121 2.1050 16.0044 180.4299 7.3878 1.7456 8.7965 86.4314 4.3850 1.0582 7.1508 16.2033 14.0425 12.2402 13.1584 1.0456 2.2883 20.5284 33.4521 594.8941 33.2320 136.7269 225.1142 43.0462 37.7997 227.1564 33.2569 25.6647 36.4759 31.8326 31.1455 42.1067 39.1757 32.5317 0.6331 12.5218 4.4678 25.0629 34.1215 1.2132 48.9376 41.3032 34.6114 20.1291 92.5878 16.2529 58.8062 99.7493 50.8333 39.2147 1.2887 27.5756 18.0956 6.4606 83.1285
temp: 298.150 k
press: 1.00000 atm
elementType: 8 8 8 7 7 6 6 6 6 6 6 6 6 6 6 6 6 6 6 6 6 6 6 6 6 1 1 1 1 1 1 1 1 1 1 1 1 1 1 1 1 1 1 1 1 1 1 1 1 1 1 1 1 1 1 1 1
symmnumber: 1
zpe: 1290403.0 jmol-1
zpe.correction: 0.491489 hartree
zpe.thermalcorrener: 0.518808 hartree
zpe.thermalcorrenthalpy: 0.519752 hartree
zpe.thermalcorrgfe: 0.428736 hartree
zpe.sumelectzpe: -1114.558574 hartree
zpe.sumelectthermal: -1114.531255 hartree
zpe.sumelectthermalent: -1114.530311 hartree
zpe.sumelectthermalfe: -1114.621326 hartree
dipole: -1.2436 3.0140 0.0363
dipole: 3.2607
quadrupole: -119.1894 -153.1200 -152.8958
quadrupole: -9.6613 5.8798 2.3620
quadrupole: 22.5457 -11.3849 -11.1607 -9.6613 5.8798 2.3620
hfenergy: -1115.0500628 hartree
pointgroup: C01[X(C20H32N2O3)]
dipole: 0.5262211 1.1556196 0.1826338 debye
polarizability: 330.5846742|-17.7424489|259.2456731|5.0005162|6.1738073|169.65415 unknown
InChI: InChI=1S/C20H32N2O3/c1-3-5-13-22-14-11-17(12-15-22)25-20(23)21-18-9-7-8-10-19(18)24-16-6-4-2/h7-10,17,21H,3-6,11-16H2,1-2H3
charge 0 multiplicity 1
57 atoms
O  -0.386773 -0.063021 -0.712171
O  -0.053402 -2.39485 -0.886961
O  3.983049 0.327764 0.069368
N  -4.563964 0.618811 -0.227053
N  1.704802 -0.867712 -0.446229
C  -1.855305 -0.264272 -0.904625
C  -2.521436 -0.662291 0.423339
C  -2.415557 1.064194 -1.422142
C  -4.055629 -0.690646 0.254099
C  -3.952754 0.971903 -1.53395
C  -6.04764 0.684885 -0.277384
C  -6.714476 0.700423 1.113287
C  -8.239628 0.94178 1.027986
C  0.396141 -1.234278 -0.696403
C  -8.922066 0.943154 2.412731
C  2.830576 -1.718773 -0.334144
C  4.074957 -1.074469 -0.050021
C  4.83792 2.562502 0.448766
C  2.796137 -3.124963 -0.477521
C  5.212305 1.080798 0.377611
C  6.058559 3.450421 0.788317
C  5.258218 -1.825506 0.090058
C  3.987429 -3.874642 -0.336943
C  5.211826 -3.233707 -0.054684
C  5.693217 4.948738 0.855192
H  -1.988939 -1.07414 -1.64868
H  -2.16073 -1.655107 0.746431
H  -2.254406 0.082792 1.19541
H  -2.149266 1.870016 -0.714148
H  -1.975899 1.307838 -2.406758
H  -4.521954 -0.923743 1.226511
H  -4.337023 -1.515491 -0.454914
H  -4.221743 0.223126 -2.327279
H  -4.357221 1.948691 -1.857394
H  -6.316487 1.623839 -0.801178
H  -6.47775 -0.155407 -0.885514
H  -6.238844 1.495175 1.720615
H  -6.536618 -0.257023 1.642485
H  -8.701464 0.161202 0.388851
H  -8.428969 1.910799 0.522165
H  -8.781489 -0.027188 2.925585
H  -10.009141 1.125803 2.328085
H  -8.49585 1.729991 3.063148
H  1.889425 0.131442 -0.315854
H  4.405271 2.8737 -0.52146
H  4.049556 2.699317 1.21386
H  5.625006 0.726534 1.345215
H  5.9637 0.896962 -0.418323
H  1.841983 -3.609536 -0.694533
H  6.489213 3.130967 1.759084
H  6.850938 3.297306 0.027466
H  6.209414 -1.332164 0.30952
H  3.950439 -4.963292 -0.44912
H  6.131726 -3.817801 0.054336
H  4.927708 5.136238 1.631142
H  5.285074 5.30026 -0.110841
H  6.576733 5.567752 1.094766
