program: Gaussian 09
title: 000059980
version: EM64L-G09RevD.01
frameworkgroup: C1[X(C20H32N2O3)]
method: RPBEPBE
basis: SDD
operation: Freq
keyword: #p
keyword: freq=noraman
keyword: PBEPBE/SDD
title: #p freq=noraman PBEPBE/SDD
converged: YES YES NO NO
title: Mulliken charges:
elementType: O O O N N C C C C C C C C C C C C C C C C C C C C H H H H H H H H H H H H H H H H H H H H H H H H H H H H H H H H
charge: -0.326238 -0.271899 -0.274998 -0.068800 -0.468661 0.044851 -0.428732 -0.453039 -0.393395 -0.374457 -0.294868 -0.380902 -0.687607 0.245013 0.521432 -0.339923 -0.398270 -0.351252 -0.303245 -0.632871 0.414265 -0.391355 -0.692998 -0.385871 -0.200348 0.231027 0.229018 0.213743 0.219012 0.206997 0.218229 0.178667 0.173086 0.216228 0.198765 0.168772 0.215765 0.199542 0.208531 0.209215 0.220001 0.331948 0.186073 0.186207 0.211330 0.211437 0.197283 0.197685 0.204538 0.204464 0.247926 0.299780 0.209938 0.209896 0.218419 0.249001 0.221644
chargesum: 0.00000
title: Mulliken charges with hydrogens summed into heavy atoms:
elementType: O O O N N C C C C C C C C C C C C C C C C C C C C
charge: -0.326238 -0.271899 -0.274998 -0.068800 -0.136713 0.275878 0.014029 -0.027029 0.003501 0.014858 0.072669 0.034405 -0.049860 0.245013 0.521432 0.032358 0.024497 0.043715 0.105757 -0.384945 0.414265 -0.091576 -0.054744 -0.136870 0.021296
polarizability: 3.90524099e+02 -1.67380002e+00 2.18928734e+02 -3.68830393e+00 8.28177492e+00 1.64067824e+02
1716.lowfreq: -2.4683 -0.0018 -0.0011 0.0013 2.7960 8.5126 17.4997 21.9148 24.7422
frequency: 16.0412 21.4027 24.5963 35.9911 39.0729 47.4771 50.8694 65.8410 67.9897 78.7306 94.9245 104.2054 119.2526 126.0022 146.3891 160.7467 167.4345 202.8282 219.4478 222.6935 226.3444 234.3218 236.2684 252.8036 263.2946 290.4537 304.7195 334.2863 356.2337 366.0589 386.8469 431.0322 453.4430 454.1215 470.9059 483.6232 486.7252 582.5304 595.9808 599.7793 633.8153 649.2586 688.9254 701.0757 705.4016 730.8024 752.2125 759.7593 770.9007 773.6015 783.7449 820.7383 846.5994 856.2259 867.8461 876.4611 880.0169 885.8321 898.7358 899.7628 924.8923 943.2204 970.0681 975.0028 977.7236 986.7183 989.5407 1005.9297 1019.0075 1030.8518 1034.5826 1051.0453 1070.4442 1075.3225 1096.7490 1099.5216 1109.5535 1122.5827 1126.2464 1131.5223 1139.4585 1148.1386 1148.7815 1153.7950 1168.1205 1193.6988 1194.4293 1202.9811 1234.9505 1252.2286 1252.3498 1262.8797 1263.0659 1272.9882 1275.7626 1284.4039 1292.6178 1293.4124 1300.9373 1312.1508 1313.5362 1316.8142 1319.2059 1337.3702 1350.2311 1354.9697 1361.0591 1373.2200 1378.2828 1387.8297 1389.3207 1394.7597 1396.5786 1421.7903 1454.0722 1462.5837 1466.9239 1468.1107 1468.7592 1471.3741 1475.2935 1475.7833 1476.5643 1478.7693 1482.2289 1482.9186 1486.7316 1490.1123 1492.0622 1524.9273 1595.2840 1625.8940 1660.4884 2815.1662 2823.3852 2840.0740 2945.0742 2955.5598 2971.0690 2972.9039 2973.8827 2988.4350 2992.8885 2996.4901 3002.3911 3004.5656 3005.8918 3007.0602 3012.0936 3025.7416 3033.6703 3041.4188 3054.0303 3059.8730 3070.0687 3072.7442 3072.9978 3073.2165 3076.7135 3079.4194 3137.1714 3140.3213 3172.7071 3198.3525 3543.0296
redmass: 4.1195 3.5015 4.5519 2.4191 4.3204 1.8094 1.9355 4.3651 4.9331 4.5623 4.1431 3.3591 4.2619 1.8069 2.4172 4.1824 3.8406 3.3798 4.9521 1.1339 1.1754 1.7916 4.9224 3.9986 2.9675 4.5103 3.8613 3.7588 2.6678 3.7301 2.9719 3.3447 2.2947 2.8913 4.0303 3.7333 4.3469 3.7274 4.4705 2.9612 3.8209 1.6613 2.0290 5.3519 7.6468 1.0719 1.1052 3.3760 1.2105 4.8814 1.3055 1.4583 2.3108 1.1727 1.7178 1.8574 1.7260 1.3877 2.0909 2.3952 3.9524 1.5753 1.1525 5.0707 1.3002 5.4295 1.5372 2.9618 3.6925 3.5548 2.4619 2.6167 2.3309 2.5518 2.1196 1.6159 2.2994 2.4688 2.6273 1.8794 1.6766 1.4534 1.8815 2.1679 1.8284 1.3437 1.9002 1.4489 1.2964 1.2890 1.3486 1.3330 1.2401 2.1216 1.3661 1.0611 1.1677 1.1131 1.3579 1.4829 1.3195 1.3736 1.3979 1.3095 1.6104 1.5811 1.4305 1.4171 1.6559 1.2783 1.2404 4.1558 1.3551 2.7505 1.0906 1.0797 1.0670 1.0823 1.0904 1.0875 1.0619 1.0718 1.0691 1.0445 1.0934 1.4512 1.4579 1.0918 1.1698 2.2526 5.3752 6.5960 8.7087 1.0721 1.0707 1.0698 1.0551 1.0586 1.0578 1.0379 1.0357 1.0619 1.0592 1.0990 1.1060 1.0802 1.0752 1.0619 1.0733 1.1035 1.0865 1.0999 1.0870 1.1048 1.1013 1.1035 1.1013 1.0991 1.0991 1.1038 1.0886 1.0917 1.0937 1.0950 1.0760
irintensity: 0.1422 0.0806 0.0514 0.0666 0.1813 0.2145 0.1440 0.8906 2.0813 3.0674 2.2360 0.8559 0.5774 0.0070 3.6726 0.6995 1.2046 1.9289 1.8380 0.0169 0.3388 0.5203 0.3022 0.9936 14.0414 4.9031 2.2629 6.0427 8.4162 0.6700 1.9650 0.7945 3.7010 8.3716 4.0845 1.1103 1.4478 5.3322 7.9695 12.0945 2.3691 28.2133 27.5809 45.6248 8.8347 11.2157 5.4686 13.2480 9.8518 10.3168 33.7830 0.6274 4.6267 0.4215 56.9149 6.4056 0.5970 10.3423 24.5770 28.3647 7.5413 3.9204 0.8765 154.8576 4.0532 123.6606 4.7211 212.9364 42.3998 205.7318 9.8623 6.2339 25.7023 6.2328 22.5714 15.0275 11.5438 5.7883 8.5828 7.9401 3.1732 0.6840 66.6821 87.3300 567.4010 66.8369 14.1312 0.4621 6.2652 3.1179 17.4237 11.8158 0.0216 130.1601 22.0553 0.1398 16.3379 0.9345 3.2337 14.2482 9.3043 1.9681 0.1293 11.4424 43.6358 2.6448 29.7139 1.3689 6.5049 4.7850 6.3010 210.6766 4.3025 147.6501 7.3695 1.8948 0.4105 0.6683 10.0818 3.0190 0.6655 17.4308 19.3554 14.4184 25.3772 78.5530 94.6312 13.1402 41.8831 325.0781 73.9646 404.6509 196.2714 53.1182 35.7627 219.4259 26.2078 19.9091 56.0772 34.0225 45.4626 17.5513 41.9920 3.3710 23.2109 25.7318 8.3024 11.4515 33.1209 12.2113 43.7107 11.3777 35.1842 32.8880 120.9084 9.7907 91.7174 53.1909 52.2095 40.5200 18.9393 2.9292 11.9301 7.2243 26.8203
temp: 298.150 k
press: 1.00000 atm
elementType: 8 8 8 7 7 6 6 6 6 6 6 6 6 6 6 6 6 6 6 6 6 6 6 6 6 1 1 1 1 1 1 1 1 1 1 1 1 1 1 1 1 1 1 1 1 1 1 1 1 1 1 1 1 1 1 1 1
symmnumber: 1
zpe: 1290671.1 jmol-1
zpe.correction: 0.491591 hartree
zpe.thermalcorrener: 0.518868 hartree
zpe.thermalcorrenthalpy: 0.519812 hartree
zpe.thermalcorrgfe: 0.429834 hartree
zpe.sumelectzpe: -1114.556287 hartree
zpe.sumelectthermal: -1114.529009 hartree
zpe.sumelectthermalent: -1114.528065 hartree
zpe.sumelectthermalfe: -1114.618043 hartree
dipole: -0.8021 -1.0581 -0.0938
dipole: 1.3311
quadrupole: -112.5893 -154.1959 -153.0106
quadrupole: -2.7188 -3.1269 2.4155
quadrupole: 27.3426 -14.2640 -13.0786 -2.7188 -3.1269 2.4155
hfenergy: -1115.0478772 hartree
pointgroup: C01 [X(C20H32N2O3)]
dipole: 0.3104115 0.3562378 -0.2258283 debye
polarizability: 390.5109126|2.5669012|200.4859197|3.7984209|-27.1729816|182.5238244 unknown
InChI: InChI=1S/C20H32N2O3/c1-3-5-6-15-24-19-9-7-8-17(16-19)21-20(23)25-18-10-13-22(12-4-2)14-11-18/h7-9,16,18,21H,3-6,10-15H2,1-2H3
charge 0 multiplicity 1
57 atoms
O  -2.241578 0.240402 -0.413692
O  -1.535997 -1.613547 0.868385
O  4.712711 0.628431 -0.184749
N  -6.419407 0.789238 0.239099
N  -0.029045 -0.052339 -0.09734
C  -3.668455 -0.129184 -0.162201
C  -4.137273 0.430273 1.190437
C  -4.486397 0.464986 -1.313098
C  -5.6512 0.181185 1.356559
C  -5.991494 0.221575 -1.064239
C  -7.885008 0.685668 0.461979
C  -8.720524 1.606128 -0.452437
C  -10.219674 1.570789 -0.082856
C  -1.274733 -0.584685 0.194959
C  1.246205 -0.535325 0.305858
C  8.496132 1.096686 -0.022952
C  7.015227 1.336833 -0.396453
C  9.4443 2.15981 -0.623406
C  6.091944 0.271796 0.198388
C  2.374774 0.215887 -0.098979
C  3.673798 -0.199187 0.270775
C  1.413047 -1.714217 1.083949
C  10.920971 1.93509 -0.233691
C  3.859449 -1.370996 1.046777
C  2.718198 -2.107655 1.438074
H  -3.731679 -1.235098 -0.1535
H  -3.582808 -0.052418 2.014987
H  -3.942234 1.51822 1.217429
H  -4.297296 1.552555 -1.36873
H  -4.183127 0.010417 -2.274028
H  -5.996986 0.631363 2.305029
H  -5.837777 -0.924086 1.426805
H  -6.203265 -0.881265 -1.110932
H  -6.571192 0.698787 -1.872607
H  -8.078854 0.974962 1.513769
H  -8.244201 -0.372213 0.349002
H  -8.326239 2.636171 -0.363095
H  -8.602984 1.308693 -1.512572
H  -10.629019 0.546065 -0.166864
H  -10.382085 1.913222 0.956648
H  -10.810616 2.224996 -0.749017
H  -0.051869 0.797913 -0.664531
H  8.606242 1.095289 1.081821
H  8.812893 0.090663 -0.369874
H  6.691144 2.331556 -0.034447
H  6.897127 1.341215 -1.497123
H  9.120427 3.1660 -0.288161
H  9.345534 2.153149 -1.727794
H  6.174615 0.248342 1.305487
H  6.339765 -0.735872 -0.196634
H  2.270693 1.128288 -0.697029
H  0.539836 -2.289702 1.394208
H  11.051262 1.970454 0.864503
H  11.278405 0.947462 -0.5818
H  11.577353 2.706498 -0.676341
H  4.85621 -1.708388 1.342139
H  2.852456 -3.015282 2.037308
