program: Gaussian 09
title: 000059950
version: EM64L-G09RevD.01
frameworkgroup: C1[X(C15H21FN2O)]
method: RPBEPBE
basis: SDD
operation: Freq
keyword: #p
keyword: freq=noraman
keyword: PBEPBE/SDD
title: #p freq=noraman PBEPBE/SDD
converged: YES YES NO NO
title: Mulliken charges:
elementType: F O N N C C C C C C C C C C C C C C C H H H H H H H H H H H H H H H H H H H H H
charge: -0.208381 -0.316188 -0.130370 -0.579918 0.039241 -0.137086 -0.638053 -0.432177 0.462247 0.190079 -0.350458 -0.400508 -0.335801 -0.380550 -0.378284 -0.384436 0.317212 -0.671197 -0.652407 0.265242 0.239721 0.234921 0.209176 0.174249 0.273597 0.231393 0.256478 0.308360 0.258455 0.201990 0.257977 0.214053 0.254669 0.253964 0.218248 0.206591 0.250235 0.212000 0.250517 0.215196
chargesum: 0.00000
title: Mulliken charges with hydrogens summed into heavy atoms:
elementType: F O N N C C C C C C C C C C C C C C C
charge: -0.208381 -0.316188 -0.130370 -0.015079 0.039241 0.128156 -0.163410 -0.048751 0.462247 0.190079 -0.076862 -0.169115 0.124644 0.091481 -0.123615 -0.130472 0.317212 0.003877 0.025306
polarizability: 2.03704292e+02 -1.18017606e+01 1.65777091e+02 -2.07812366e+00 -1.34115439e+01 1.57148402e+02
1716.lowfreq: -9.5963 -6.8239 0.0007 0.0008 0.0008 5.5724 23.9468 34.4060 39.2244
frequency: 22.7962 34.3274 39.1353 51.8918 64.5098 94.2190 103.8740 129.4207 149.9342 158.6719 169.6528 190.3818 211.5384 217.5324 236.9584 268.8339 308.2258 323.2101 353.2444 356.1566 371.2647 391.4906 409.1465 412.6786 437.5072 475.1715 482.2264 525.1610 542.6964 570.1563 627.8521 633.1611 691.2659 728.0088 745.7267 758.8811 775.7704 784.6898 798.5572 817.2325 829.6277 839.6462 864.2681 899.7266 922.6041 939.8854 945.5336 970.2548 986.7201 997.5656 1011.9200 1023.6503 1060.9429 1068.9129 1076.5519 1080.9928 1099.2775 1107.8624 1108.5657 1125.4210 1149.6383 1156.6348 1187.3726 1200.2203 1208.3843 1232.7127 1261.9312 1283.3905 1293.2023 1296.3259 1302.7535 1338.5619 1351.0794 1355.0472 1364.8668 1381.7297 1388.3587 1399.2182 1404.0162 1417.4659 1451.7089 1455.1166 1467.6268 1468.9178 1470.5583 1475.5516 1481.5654 1485.6569 1495.1348 1541.0896 1596.3756 1609.7086 1633.7847 2861.7992 2984.3546 2986.0859 2989.6161 3005.4111 3015.0660 3069.5957 3076.8432 3083.4333 3084.8163 3094.3738 3101.6384 3108.8405 3123.2895 3136.4342 3149.2921 3171.8578 3175.5753 3182.0241 3417.3705 3559.1891
redmass: 3.6496 3.0382 4.6095 3.4680 4.5332 4.6777 2.9117 3.3708 2.8759 5.6192 2.6108 3.0269 1.4321 1.4473 2.2735 2.6030 2.8530 3.2545 1.3477 4.1045 3.0865 4.2675 2.4706 2.9869 3.1716 3.8272 3.7112 3.0093 3.4323 3.7909 6.9761 4.1707 5.6327 4.3547 1.8843 1.5626 1.3639 1.2063 3.0335 1.3115 1.8746 1.6939 2.4335 1.8893 1.8307 2.0287 1.4278 1.3589 3.1595 2.2803 2.1209 2.6218 1.4419 1.9675 2.1886 1.8619 1.7887 1.3620 1.6251 1.7060 1.6734 1.5510 1.8676 1.8816 2.8998 1.8850 2.0923 1.5511 1.3477 1.2714 1.4156 1.2604 1.5264 1.3009 6.2476 1.2193 1.2054 1.9192 2.8452 2.6984 1.2122 1.2525 1.0472 1.0887 1.0461 1.1100 1.0534 1.0777 2.6613 4.2697 7.6901 6.3693 1.1182 1.0710 1.0378 1.0599 1.0428 1.0875 1.0609 1.1005 1.0978 1.0562 1.0995 1.0950 1.1024 1.0985 1.0903 1.0890 1.0897 1.0955 1.0967 1.1140 1.0462 1.0959
irintensity: 0.2757 0.0553 0.5090 0.7872 1.0001 1.8665 0.0162 1.0272 0.7865 0.5110 1.8716 2.3032 0.8303 0.7107 1.7240 0.7413 4.2603 4.4596 77.2569 8.2945 25.7094 14.8568 3.6394 0.3361 4.7779 5.4277 4.5733 17.5402 32.2528 5.8322 0.2387 7.8192 3.7736 3.2848 62.8246 97.1951 12.7167 21.4441 75.9722 2.3736 0.9886 52.9493 11.3183 11.4238 17.4254 6.5474 0.5274 0.3124 3.0716 9.8310 9.3883 3.2071 10.0877 16.1505 11.5188 9.8378 14.5902 15.3432 19.1751 19.4929 24.5766 48.8257 4.1935 35.0074 28.4560 25.7902 0.9020 42.4286 1.8268 9.0337 36.3870 4.5930 6.8555 10.8624 2.4321 18.4836 20.0748 35.2874 14.7566 83.3179 18.4340 26.1898 6.1585 10.4330 9.0871 10.5883 4.6396 14.3580 130.8486 258.3728 6.4401 8.3353 37.5658 106.9984 14.7918 46.8862 32.7257 60.8937 33.3011 8.8646 14.6594 12.7596 36.1324 23.4707 24.0709 35.3296 8.7348 11.3524 1.3965 4.1590 3.1616 16.0978 44.8855 11.6503
temp: 298.150 k
press: 1.00000 atm
elementType: 9 8 7 7 6 6 6 6 6 6 6 6 6 6 6 6 6 6 6 1 1 1 1 1 1 1 1 1 1 1 1 1 1 1 1 1 1 1 1 1
symmnumber: 1
zpe: 875700.6 jmol-1
zpe.correction: 0.333537 hartree
zpe.thermalcorrener: 0.353482 hartree
zpe.thermalcorrenthalpy: 0.354426 hartree
zpe.thermalcorrgfe: 0.284013 hartree
zpe.sumelectzpe: -867.292554 hartree
zpe.sumelectthermal: -867.272609 hartree
zpe.sumelectthermalent: -867.271665 hartree
zpe.sumelectthermalfe: -867.342078 hartree
dipole: -2.8760 -3.0097 2.7665
dipole: 4.9983
quadrupole: -121.1391 -111.7903 -108.6766
quadrupole: 2.3118 1.2917 -0.7532
quadrupole: -7.2704 2.0784 5.1920 2.3118 1.2917 -0.7532
hfenergy: -867.6260908 hartree
pointgroup: C01 [X(C15H21F1N2O1)]
dipole: 1.0739402 -1.2517292 -1.0709315 debye
polarizability: 203.5373546|11.9654742|167.070925|-4.8350315|12.3305102|156.0215047 unknown
InChI: InChI=1S/C15H21FN2O/c1-3-18(4-2)14(19)15(9-12(15)10-17)11-5-7-13(16)8-6-11/h5-8,12H,3-4,9-10,17H2,1-2H3
charge 0 multiplicity 1
40 atoms
F  -4.979909 -0.299059 1.012403
O  1.917288 0.648584 1.289528
N  1.795872 -1.331206 0.096089
N  1.920297 3.471121 0.447628
C  0.428663 0.641031 -0.655391
C  0.760046 2.054592 -1.202486
C  0.78464 0.844956 -2.141772
C  2.0466 2.796817 -0.857063
C  -1.0078 0.376944 -0.246729
C  1.439195 -0.006487 0.297938
C  -1.429857 0.758066 1.056825
C  -1.947275 -0.234119 -1.114549
C  2.799055 -1.923352 1.02049
C  1.217513 -2.227338 -0.931323
C  -2.753272 0.53304 1.487912
C  -3.281167 -0.462475 -0.705339
C  -3.651307 -0.07362 0.591642
C  4.245421 -1.652294 0.55573
C  0.169372 -3.210317 -0.36133
H  -0.112962 2.713906 -1.273354
H  -0.001713 0.748768 -2.897032
H  1.770759 0.499929 -2.47352
H  2.213148 3.56422 -1.638989
H  2.904793 2.081696 -0.920403
H  -0.709641 1.23541 1.729713
H  -1.642526 -0.54159 -2.120882
H  2.617455 4.205741 0.604883
H  1.895134 2.774081 1.204519
H  2.641442 -1.482497 2.01924
H  2.606804 -3.009632 1.083207
H  0.760088 -1.611516 -1.719928
H  2.047571 -2.79456 -1.397708
H  -3.089369 0.82392 2.487434
H  -4.014998 -0.930065 -1.368258
H  4.965875 -2.121926 1.250316
H  4.428705 -2.0603 -0.455308
H  4.440158 -0.566614 0.539586
H  0.595849 -3.841299 0.438793
H  -0.695156 -2.663569 0.051222
H  -0.193395 -3.880786 -1.162331
