program: Gaussian 09
title: 000060033
version: EM64L-G09RevD.01
frameworkgroup: C1[X(C21H27N3OS2)]
method: RPBEPBE
basis: SDD
operation: Freq
keyword: #p
keyword: freq=noraman
keyword: PBEPBE/SDD
title: #p freq=noraman PBEPBE/SDD
converged: YES YES NO NO
title: Mulliken charges:
elementType: S S O N N N C C C C C C C C C C C C C C C C C C C C C H H H H H H H H H H H H H H H H H H H H H H H H H H H
charge: 0.185915 -0.044691 -0.268696 0.015061 -0.400762 -0.122989 -0.376892 -0.362795 -0.420009 -0.860055 -0.638667 -0.637502 0.205165 0.415839 0.245643 -0.352468 -0.366686 0.326507 -0.455058 -0.336960 -0.354594 -0.353293 -0.199083 -0.223345 -0.260479 -0.240918 -0.686444 0.231656 0.251304 0.261885 0.217195 0.322869 0.321357 0.247063 0.216628 0.224309 0.251814 0.209703 0.223883 0.315299 0.240471 0.251560 0.233091 0.317319 0.240566 0.247568 0.221345 0.221140 0.223836 0.205119 0.203359 0.204443 0.231320 0.232155
chargesum: 0.00000
title: Mulliken charges with hydrogens summed into heavy atoms:
elementType: S S O N N N C C C C C C C C C C C C C C C C C C C C C
charge: 0.185915 -0.044691 -0.268696 0.015061 -0.085463 -0.122989 0.106068 0.116284 -0.420009 -0.215829 0.049332 0.047898 0.205165 0.415839 0.245643 -0.111997 -0.115126 0.326507 -0.221968 -0.019640 -0.114028 -0.105726 0.022262 -0.002205 -0.036643 0.167560 -0.018526
polarizability: 4.61672993e+02 -3.63996836e+01 3.39568278e+02 1.96670505e+00 1.19458726e+01 1.91422967e+02
1716.lowfreq: -4.2545 -3.3133 -0.0019 -0.0018 -0.0012 4.8361 16.1229 23.3026 24.6352
frequency: 16.0389 23.3003 24.6221 27.9156 41.5135 44.3190 58.6725 65.2559 72.0526 81.1047 84.8694 98.0356 118.0322 119.1432 135.8107 140.2601 159.6844 165.4592 206.0499 212.4338 223.1544 242.6445 245.6266 265.5227 289.8818 295.4949 332.2497 340.5354 360.5353 366.4461 383.7832 385.7721 410.3247 416.7277 418.0439 446.7924 470.5827 504.5144 514.1863 521.8601 533.8373 562.0157 582.4824 582.8567 614.0149 631.1667 662.6372 698.0062 707.8788 717.6406 737.5673 743.2090 764.0388 771.9233 781.7105 784.7938 799.4425 812.8901 827.0223 831.2648 838.1869 848.2840 888.8106 902.6222 908.9117 918.1832 924.6009 951.1043 957.5494 959.9982 972.2848 983.6198 997.6762 1000.5350 1008.1398 1024.9872 1039.1491 1068.2829 1077.0931 1083.9101 1094.6986 1107.1800 1117.7787 1136.7328 1146.0244 1166.9483 1170.2506 1170.8387 1181.9436 1187.2714 1193.4116 1216.8573 1254.1632 1261.7404 1261.9426 1268.3000 1291.4125 1293.3849 1318.5865 1336.8677 1338.7326 1348.0135 1350.4876 1370.9215 1386.0415 1388.7230 1390.1889 1399.5314 1416.3585 1424.1409 1427.8031 1437.7418 1460.9571 1463.5367 1467.3190 1470.1337 1476.3484 1480.4286 1482.2986 1483.4425 1488.4223 1497.1010 1503.0711 1551.0732 1565.2298 1603.0274 1615.1643 1616.1862 1631.7919 2946.4633 2989.2685 2990.7943 2995.9788 2996.6736 3002.4448 3007.6666 3011.0540 3061.7653 3072.3549 3088.0603 3089.1931 3093.0707 3103.4170 3104.5496 3104.5829 3113.1233 3118.7643 3126.5604 3127.1053 3139.6855 3146.7988 3159.4378 3161.1193 3169.5610 3186.7279 3333.6823
redmass: 4.6550 4.9044 4.3297 4.1443 3.6412 3.7351 5.8415 4.5406 3.6751 3.3367 4.2185 4.9730 2.6219 2.8346 3.3185 5.8898 5.7905 4.4391 1.2428 1.1188 3.6542 1.7339 1.9601 4.4379 3.4926 3.9917 3.8620 4.4535 3.4228 4.0486 5.4045 3.9859 2.9858 3.4802 3.2364 4.5681 4.2140 3.3834 4.1815 2.8788 3.3590 6.0825 4.6671 5.2044 6.3591 6.7457 5.5359 1.9037 5.2127 4.0513 3.5051 1.4219 1.7255 1.5519 1.1606 4.6628 1.3061 1.6699 2.3614 1.2052 1.8628 1.2657 2.9039 3.1888 2.4901 1.4407 1.3645 5.4798 1.4241 2.5909 1.3393 6.1737 2.5367 1.3034 2.7965 2.0889 2.8726 2.2706 1.8713 1.5435 1.8660 1.3878 1.9705 1.4380 1.8877 1.2767 1.1574 1.2698 1.3688 1.7324 2.6664 3.3916 2.1394 1.1942 1.3039 1.2778 1.2268 1.3060 1.4301 2.6645 1.2671 3.9632 1.2792 1.4255 1.2099 5.6484 1.2073 1.2777 1.2019 3.3788 1.8723 2.4075 1.0402 1.1012 1.0494 1.0584 1.2973 1.0533 1.5598 1.0762 1.6142 1.5741 1.3052 2.4703 6.9455 4.9735 4.3284 6.3017 3.7759 1.0552 1.0358 1.0357 1.0362 1.0651 1.1072 1.0611 1.0613 1.1028 1.1006 1.0999 1.0999 1.0989 1.1017 1.1017 1.1012 1.0873 1.0982 1.0887 1.0871 1.0938 1.0877 1.0938 1.0997 1.0972 1.0952 1.0798
irintensity: 0.9936 0.1690 0.3900 0.6219 0.1697 0.1837 2.4691 0.0599 0.1002 0.2077 1.9120 0.6259 3.5387 1.1119 0.3253 1.6917 1.4260 2.8089 0.6063 0.0714 1.6883 2.6395 2.5124 3.8999 1.9775 2.8262 1.4774 0.7058 23.0061 2.7351 1.1995 1.1712 0.0589 7.3434 5.2685 8.2291 6.8573 11.7114 11.0064 16.1303 4.1847 7.2444 8.3991 1.6528 1.7645 0.2146 22.9255 28.2301 13.1166 9.3414 6.7639 12.8808 1.3978 122.3185 2.2727 1.6638 39.8914 42.3049 17.6637 10.8862 46.8492 2.8411 44.1874 41.1175 20.7247 12.4727 6.5043 1.2216 5.7913 24.4705 0.0549 4.1574 4.1895 2.7284 19.4693 13.2157 86.4937 16.1046 23.4109 9.6127 12.5628 13.6416 10.4160 4.1615 38.3151 13.9185 9.9957 35.4040 72.1900 104.5712 110.0580 258.3664 14.2460 12.3899 36.7018 50.2441 16.3442 1.7356 5.8639 57.7775 12.6182 7.2397 26.9059 28.6758 9.5953 59.2906 25.6765 40.4823 55.2054 11.5229 133.7385 16.2636 11.3099 30.1639 16.3080 3.2519 200.5025 5.4318 170.3186 39.0311 36.1421 47.4004 100.3234 324.6426 7.9732 406.3460 8.6883 39.6153 402.9499 39.6050 26.0132 25.5957 34.8615 8.9071 40.2156 31.2743 36.6521 7.4902 3.2885 28.1625 33.2214 29.6818 6.8387 48.2100 34.1140 11.2082 4.3053 22.8444 0.9641 34.0795 9.2272 18.8272 35.5239 8.8758 13.9569 400.0323
temp: 298.150 k
press: 1.00000 atm
elementType: 16 16 8 7 7 7 6 6 6 6 6 6 6 6 6 6 6 6 6 6 6 6 6 6 6 6 6 1 1 1 1 1 1 1 1 1 1 1 1 1 1 1 1 1 1 1 1 1 1 1 1 1 1 1
symmnumber: 1
zpe: 1154276.9 jmol-1
zpe.correction: 0.439641 hartree
zpe.thermalcorrener: 0.468147 hartree
zpe.thermalcorrenthalpy: 0.469091 hartree
zpe.thermalcorrgfe: 0.376678 hartree
zpe.sumelectzpe: -1850.031033 hartree
zpe.sumelectthermal: -1850.002527 hartree
zpe.sumelectthermalent: -1850.001583 hartree
zpe.sumelectthermalfe: -1850.093997 hartree
dipole: -2.1132 -6.8253 -2.6274
dipole: 7.6127
quadrupole: -157.7771 -158.2860 -179.0674
quadrupole: 3.2023 3.3538 8.5948
quadrupole: 7.2664 6.7575 -14.0239 3.2023 3.3538 8.5948
hfenergy: -1850.4706743 hartree
pointgroup: C01 [X(C21H27N3O1S2)]
dipole: -1.0149657 -2.5449372 1.2098229 debye
polarizability: 422.200863|-58.7296595|362.4982171|-63.3951909|9.7482925|207.9651584 unknown
InChI: InChI=1S/C21H27N3OS2/c1-4-24(5-2)21(26)27-16-20(22-17-10-8-7-9-11-17)23-18-12-14-19(15-13-18)25-6-3/h7-15,22H,4-6,16H2,1-3H3
charge 0 multiplicity 1
54 atoms
S  -0.743477 -2.078245 -0.339061
S  1.26144 -3.275976 -2.457337
O  -4.635309 3.767002 0.842112
N  0.275586 -4.588563 -0.273819
N  1.904976 -0.115859 -1.34539
N  0.362769 1.549964 -0.658188
C  -0.522982 -4.73349 0.976977
C  1.046509 -5.798455 -0.686048
C  0.326477 -3.444831 -1.018319
C  -0.450621 -0.66021 -1.567592
C  -1.9546 -5.24735 0.715752
C  2.471687 -5.808417 -0.098281
C  0.610762 0.344852 -1.127476
C  3.153842 0.471613 -1.02367
C  -0.922048 2.012865 -0.288102
C  -1.774095 1.32227 0.618911
C  -1.343876 3.292019 -0.760045
C  -3.425435 3.12556 0.517075
C  4.318847 -0.290836 -1.329049
C  3.296462 1.753248 -0.423558
C  -3.01326 1.869083 1.023857
C  -2.579801 3.834501 -0.37528
C  5.599393 0.215986 -1.036044
C  4.588519 2.243813 -0.133897
C  5.745429 1.48905 -0.433607
C  -5.539736 3.081503 1.782126
C  -6.761422 3.980339 1.955747
H  0.027246 -5.437322 1.627464
H  -0.54742 -3.762877 1.502926
H  1.090024 -5.815931 -1.787668
H  0.472047 -6.679177 -0.34429
H  -1.434485 -0.177754 -1.656363
H  -0.172315 -1.154675 -2.517117
H  -2.517887 -4.537188 0.08736
H  -1.941725 -6.228848 0.208664
H  -2.49204 -5.364784 1.67408
H  3.04329 -4.941989 -0.470886
H  2.457337 -5.775014 1.006249
H  2.99766 -6.729911 -0.40663
H  1.951581 -1.05428 -1.774342
H  -1.443765 0.368274 1.046987
H  -0.680055 3.843087 -1.43377
H  4.211779 -1.27925 -1.794122
H  2.398224 2.332233 -0.20336
H  -3.632748 1.313406 1.734307
H  -2.909826 4.810472 -0.744782
H  6.484485 -0.383402 -1.278125
H  4.687493 3.232174 0.33004
H  6.741825 1.883071 -0.206015
H  -5.017763 2.921059 2.748854
H  -5.824222 2.091276 1.368225
H  -7.481144 3.515501 2.654133
H  -7.265864 4.141399 0.987708
H  -6.465771 4.963615 2.359678
