program: Gaussian 09
title: 000059897
version: EM64L-G09RevD.01
frameworkgroup: C1[X(C13H10N2O2S)]
method: RPBEPBE
basis: SDD
operation: Freq
keyword: #p
keyword: freq=noraman
keyword: PBEPBE/SDD
title: #p freq=noraman PBEPBE/SDD
converged: YES YES NO NO
title: Mulliken charges:
elementType: S O O N N C C C C C C C C C C C C C H H H H H H H H H H
charge: 0.227843 -0.269680 -0.283303 -0.068787 -0.568855 0.067460 0.193338 0.227515 0.107577 0.167877 0.285775 -0.359422 -0.349298 -0.760811 -0.246791 -0.208542 -0.688108 -0.226585 0.282472 0.260294 0.235973 0.258232 0.258375 0.234954 0.329639 0.235786 0.328596 0.328474
chargesum: 0.00000
title: Mulliken charges with hydrogens summed into heavy atoms:
elementType: S O O N N C C C C C C C C C C C C C
charge: 0.227843 -0.269680 -0.283303 -0.068787 0.088216 0.067460 0.193338 0.227515 0.107577 0.167877 0.285775 -0.076951 -0.089004 -0.008231 -0.011837 0.027244 -0.358469 -0.226585
polarizability: 3.03487765e+02 3.40225157e+00 1.94557354e+02 -2.60491645e-01 -6.72863065e-01 7.13329001e+01
1716.lowfreq: -3.0657 -0.0012 0.0015 0.0022 3.6754 6.8851 8.3154 48.3216 98.7509
frequency: 5.3093 48.1627 98.7456 121.4411 135.4473 147.2351 156.7672 228.0793 246.1373 272.8157 277.7704 286.0448 296.8199 354.6523 360.4705 373.6499 394.9174 437.5816 438.5371 517.1268 526.5375 529.5933 555.0614 567.3710 574.7339 580.8268 629.1667 652.4637 658.2165 708.2487 756.2848 766.2178 782.3240 806.4473 808.6285 837.6167 881.3352 885.3536 955.8499 971.5037 1001.6070 1006.2781 1022.7256 1037.3972 1065.4453 1099.3919 1100.4182 1140.2572 1163.2250 1194.6068 1213.6607 1249.0264 1267.2892 1297.0183 1366.5459 1404.1801 1407.8998 1443.1095 1447.3235 1448.2358 1458.9121 1471.8391 1533.1598 1550.2422 1581.1364 1598.7058 1621.2926 1629.8539 3010.8963 3101.0737 3119.9437 3139.2424 3153.8662 3167.4459 3176.9063 3265.3356 3563.0046 3712.9808
redmass: 4.5573 9.5792 3.9117 5.8144 1.7627 1.9565 5.1139 5.9531 5.9318 7.2813 5.2684 1.1696 3.7980 5.0434 4.9696 5.1927 1.2122 4.1227 4.7594 10.4746 3.8753 6.7353 4.4354 7.0831 5.6142 5.6348 5.8594 6.2022 6.2015 3.7121 8.5604 1.6485 1.3728 5.0032 2.8797 4.8302 1.4615 6.9519 3.0443 1.3631 1.3257 2.1641 1.9526 1.4876 2.1586 1.7956 2.1542 2.4790 1.1859 2.6052 3.4820 2.2174 3.4073 2.7219 5.6643 1.2671 7.3897 1.0527 1.7994 1.4860 3.6077 4.2313 10.5647 8.4504 1.9197 7.8937 7.2993 2.1653 1.0358 1.0962 1.1019 1.0862 1.0902 1.0954 1.1000 1.0959 1.0449 1.1048
irintensity: 0.4769 2.9971 2.1406 2.1763 0.1897 1.1798 0.0148 0.4863 3.9972 0.1672 0.2579 76.1928 7.4729 29.4526 10.1652 3.4503 228.7577 1.5911 0.8699 1.0154 1.8232 2.4672 0.0043 6.3097 13.9378 5.1224 16.5164 11.2831 3.7282 0.1585 92.4556 31.0876 115.3695 10.8457 9.5961 15.3207 0.1810 16.2208 7.5352 3.1541 0.4099 14.4837 7.5660 5.2366 3.0116 19.4812 13.2847 100.1417 13.9000 1.8677 84.5164 4.1694 68.5985 30.1124 193.9450 38.3820 9.2557 16.4345 58.7094 40.2753 18.7031 22.0955 86.6015 79.0025 48.6166 59.5229 26.6522 479.6590 7.9029 4.2994 16.4200 4.1402 7.7448 8.4769 21.2054 30.6210 108.6982 47.1145
temp: 298.150 k
press: 1.00000 atm
elementType: 16 8 8 7 7 6 6 6 6 6 6 6 6 6 6 6 6 6 1 1 1 1 1 1 1 1 1 1
symmnumber: 1
zpe: 531518.6 jmol-1
zpe.correction: 0.202445 hartree
zpe.thermalcorrener: 0.218044 hartree
zpe.thermalcorrenthalpy: 0.218988 hartree
zpe.thermalcorrgfe: 0.157867 hartree
zpe.sumelectzpe: -1158.142548 hartree
zpe.sumelectthermal: -1158.126949 hartree
zpe.sumelectthermalent: -1158.126004 hartree
zpe.sumelectthermalfe: -1158.187126 hartree
dipole: -0.9719 3.7312 -0.0816
dipole: 3.8566
quadrupole: -71.3438 -107.5652 -116.0743
quadrupole: -8.7389 0.4504 -0.1365
quadrupole: 26.9839 -9.2374 -17.7465 -8.7389 0.4504 -0.1365
hfenergy: -1158.3449926 hartree
pointgroup: C01 [X(C13H10N2O2S1)]
dipole: -0.4181688 1.34315 -0.5685497 debye
polarizability: 303.0017422|8.4717045|178.469408|4.7835866|-41.7830956|87.9068692 unknown
InChI: InChI=1S/C13H10N2O2S/c1-7-11(9-6-18-13(14)15-9)12(16)8-4-2-3-5-10(8)17-7/h2-6H,14H2,1H3
charge 0 multiplicity 1
28 atoms
S  -4.189415 -1.585773 0.504361
O  1.336727 1.609167 -0.528274
O  0.262405 -2.151238 0.879025
N  -2.88089 0.589537 -0.348729
N  -5.257113 0.781769 -0.55941
C  -0.452334 0.021463 0.016096
C  1.982881 -0.589331 0.314673
C  -0.023371 1.273722 -0.437881
C  0.55975 -0.988976 0.434471
C  2.332204 0.693181 -0.162844
C  -1.888539 -0.327731 0.09399
C  3.031865 -1.478667 0.674587
C  3.672761 1.116508 -0.2929
C  -0.833845 2.455629 -0.89398
C  4.373025 -1.081364 0.553832
C  4.693114 0.218818 0.06915
C  -2.389893 -1.534415 0.578188
C  -4.103609 0.113571 -0.2130
H  2.749111 -2.469733 1.043263
H  3.888109 2.121279 -0.667565
H  -0.149431 3.286171 -1.131247
H  -1.552938 2.764975 -0.119077
H  -1.439041 2.201486 -1.779271
H  5.177283 -1.77017 0.831953
H  -1.82293 -2.37786 0.958611
H  5.740476 0.525381 -0.023378
H  -5.175467 1.715375 -0.954375
H  -6.173896 0.363524 -0.439373
