program: Orca
programVersion: 6.0.x
elementType: Au C C C C H C H H C P C C H C H H H H H H H H H H H H C C C C H C H C F F F
elementType: Au
keywords: optts freq wb97x-d3 def2-svp autoaux tightscf
charge: 1
multiplicity: 1
frequency: 0.00 0.00 0.00 0.00 0.00 0.00 -467.02 9.66 16.69 29.43 32.60 55.62 88.14 103.41 125.09 143.79 156.63 169.06 175.53 179.90 193.37 200.77 217.90 226.86 234.27 264.14 265.00 276.56 279.18 292.73 320.22 342.37 366.29 381.01 418.95 476.74 498.57 539.51 546.47 563.56 594.97 654.82 661.75 687.65 696.77 698.56 763.19 767.81 768.83 792.33 798.75 805.93 825.35 862.11 863.45 891.26 897.41 914.97 928.86 960.84 961.73 966.16 968.88 994.56 1017.91 1030.70 1072.86 1096.35 1154.55 1167.34 1224.88 1256.71 1280.20 1305.17 1306.24 1312.88 1320.65 1338.66 1357.48 1377.17 1411.80 1411.88 1413.82 1414.16 1422.25 1423.30 1428.15 1433.25 1444.74 1447.94 1504.50 1607.65 1655.71 1705.82 1724.13 1865.15 3071.74 3073.04 3073.35 3102.60 3111.87 3167.61 3182.41 3184.24 3189.99 3190.52 3190.77 3196.37 3196.56 3197.12 3236.92 3252.08 3277.19 3283.43
frequency: 9.66 16.69 29.43 32.60 55.62 88.14 103.41 125.09 143.79 156.63 169.06 175.53 179.90 193.37 200.77 217.90 226.86 234.27 264.14 265.00 276.56 279.18 292.73 320.22 342.37 366.29 381.01 418.95 476.74 498.57 539.51 546.47 563.56 594.97 654.82 661.75 687.65 696.77 698.56 763.19 767.81 768.83 792.33 798.75 805.93 825.35 862.11 863.45 891.26 897.41 914.97 928.86 960.84 961.73 966.16 968.88 994.56 1017.91 1030.70 1072.86 1096.35 1154.55 1167.34 1224.88 1256.71 1280.20 1305.17 1306.24 1312.88 1320.65 1338.66 1357.48 1377.17 1411.80 1411.88 1413.82 1414.16 1422.25 1423.30 1428.15 1433.25 1444.74 1447.94 1504.50 1607.65 1655.71 1705.82 1724.13 1865.15 3071.74 3073.04 3073.35 3102.60 3111.87 3167.61 3182.41 3184.24 3189.99 3190.52 3190.77 3196.37 3196.56 3197.12 3236.92 3252.08 3277.19 3283.43
formula: C15H18F3AuP
InChI: InChI=1/C12H9F3.C3H9P.Au/c1-3-4-5-8(2)9-6-10(13)12(15)11(14)7-9;1-4(2)3;/h1,6-7H,2,4-5H2;1-3H3;/rC15H18AuF3P/c1-11(7-5-6-8-16-20(2,3)4)12-9-13(17)15(19)14(18)10-12/h8-10H,1,5,7H2,2-4H3
38 atoms
Au 0.276357 -2.23481 0.201184
C  1.10471 -0.334096 -0.077429
C  0.798694 0.211248 -1.194982
C  0.668868 2.482581 -1.670571
C  1.931781 1.968323 -1.670752
H  2.694008 2.316241 -0.969609
C  0.026085 0.304988 -2.462931
H  -0.844618 -0.365444 -2.415137
H  0.656341 -0.018917 -3.304602
C  -0.352631 1.790364 -2.552097
P  -0.624313 -4.344093 0.574563
C  -2.389541 -4.30346 1.008247
C  -0.511427 -5.441264 -0.87085
H  1.755519 0.090514 0.692762
C  0.183518 -5.248097 1.928815
H  0.096742 -4.672744 2.86182
H  -0.288739 -6.232969 2.062861
H  1.249767 -5.384776 1.697352
H  -2.528361 -3.725856 1.93351
H  -2.769655 -5.325549 1.155847
H  -2.955953 -3.817602 0.200668
H  -1.036049 -4.985111 -1.722772
H  -0.964782 -6.418031 -0.644048
H  0.544323 -5.584948 -1.14286
H  2.298161 1.354472 -2.497437
H  -0.337939 2.174423 -3.582958
H  -1.361647 1.946384 -2.150398
C  0.246389 3.564827 -0.754009
C  -0.892094 4.322575 -1.062569
C  0.973724 3.857597 0.410025
C  -1.274275 5.360929 -0.229023
H  -1.488507 4.139118 -1.957599
C  0.558823 4.886314 1.23603
H  1.855701 3.288364 0.707569
C  -0.563371 5.653393 0.930063
F  -2.340683 6.099866 -0.518782
F  -0.9451 6.639053 1.727913
F  1.22691 5.168561 2.35026
totalener: -1357.89699023658591 hartree
nucrepener: 1749.03321831323046 hartree
electener: -3106.84962410096841 hartree
oneelecener: -5370.93914271700942 hartree
twoeener: 2264.08951861604100 hartree
cpcmener: -0.07713404906595 hartree
kineticenergy: 1258.03932208649508 hartree
temp: 298.15 k
press: 1.00 atm
thermalcorrenthalpy: 0.00094421 hartree
totalenthalpy: -1357.59826797 hartree
totalentropycorr: -0.07410259 hartree
gibbsenthalpy: -1357.67237056 hartree
gibbsminuselec: 0.24145635 hartree
energy: -2100.8118 -675.9099 -675.7440 -675.7393 -283.3138 -283.3048 -283.2951 -282.7101 -282.1340 -281.5586 -281.2692 -281.1808 -281.1211 -281.1151 -280.9446 -280.9067 -280.4932 -280.4873 -280.4841 -182.8145 -132.6467 -132.6463 -132.5848 -116.6088 -67.2699 -66.7832 -66.7780 -37.3689 -36.9735 -36.7564 -27.9270 -27.1152 -25.1963 -24.7643 -24.3998 -24.1057 -23.5436 -22.3070 -22.3043 -21.7746 -21.0755 -20.8657 -19.3466 -18.7321 -18.5047 -18.3808 -18.0551 -17.4010 -17.2422 -17.0604 -16.9699 -16.2711 -16.2061 -15.9617 -15.8316 -15.5645 -15.4471 -15.2155 -14.9223 -14.9179 -14.8117 -14.3865 -14.2228 -14.0572 -14.0521 -13.9593 -13.8396 -13.5729 -13.4518 -13.2685 -13.0567 -12.7946 -12.6337 -12.5352 -12.0213 -11.7412 -11.4722 -11.3586 -11.3534 -10.4491 -10.3238 -9.9942 -9.9010 -9.0673 -0.9905 0.6213 0.9772 1.2159 1.3474 2.2562 2.7138 3.0531 3.3190 3.4991 4.0221 electronvolt
chargesum: 1.0000000
charge: 0.062179 -0.305582 -0.064017 -0.161339 -0.029405 0.099707 0.097378 0.109680 0.099327 0.094389 0.102146 -0.175175 -0.175206 0.141848 -0.173716 0.104135 0.094120 0.103999 0.104356 0.094440 0.102981 0.102972 0.094401 0.104430 0.127048 0.089514 0.083001 0.062020 -0.098634 -0.094206 0.228415 0.071803 0.225640 0.064873 0.170947 -0.191179 -0.176039 -0.191251
charge: -0.221539 -0.160442 0.139745 0.057700 0.008382 0.051775 -0.013510 0.073854 0.063467 -0.012362 0.754827 -0.183254 -0.183399 0.098825 -0.182898 0.055474 0.047989 0.055456 0.055323 0.047791 0.054954 0.054911 0.047835 0.055307 0.068917 0.063273 0.051284 -0.029754 -0.036068 -0.033979 0.065435 0.063896 0.066163 0.062389 0.037668 -0.052213 -0.040786 -0.052435
qa: 0.0622 -0.3056 -0.0640 -0.1613 -0.0294 0.0997 0.0974 0.1097 0.0993 0.0944 0.1021 -0.1752 -0.1752 0.1418 -0.1737 0.1041 0.0941 0.1040 0.1044 0.0944 0.1030 0.1030 0.0944 0.1044 0.1270 0.0895 0.0830 0.0620 -0.0986 -0.0942 0.2284 0.0718 0.2256 0.0649 0.1709 -0.1912 -0.1760 -0.1913
va: 1.5747 3.8843 3.9265 4.0465 3.9002 0.9830 3.9140 0.9849 0.9757 3.9370 4.1758 3.8946 3.8952 0.9744 3.8954 0.9848 0.9892 0.9847 0.9842 0.9891 0.9846 0.9849 0.9893 0.9843 0.9743 0.9825 0.9802 3.7597 3.8259 3.8356 3.8778 1.0025 3.8878 1.0032 3.8079 1.1693 1.1945 1.1693
dispcorr: -0.016863983 hartree
energy: -1357.916107831298
zeropoint: 0.29394924 hartree
thermalvibcorrection: 0.01961886 hartree
thermalrotcorrection: 0.00141627 hartree
thermaltrasncorrection: 0.00141627 hartree
thermaltotal: -1357.59970719 hartree
thermalcorr: 0.02245140 hartree
nonthermalcorr: 0.29394924 hartree
totalcorr: 0.31640064 hartree
totalenthalpy: -1357.59876298 hartree
