program: Orca
programVersion: 6.0.x
elementType: Au C C C C H C H H C P C C H C H H H H H H H H H H H H C C C C H C H C H H C N
elementType: Au
charge: 1
multiplicity: 1
keywords: wB97X-D3 def2-TZVPPD autoaux TightSCF
formula: C16H20AuNP
InChI: InChI=1/C13H11N.C3H9P.Au/c1-3-4-5-11(2)13-8-6-12(10-14)7-9-13;1-4(2)3;/h1,6-9H,2,4-5H2;1-3H3;/rC16H20AuNP/c1-14(7-5-6-12-17-19(2,3)4)16-10-8-15(13-18)9-11-16/h8-12H,1,5,7H2,2-4H3
39 atoms
Au 0.329428 -1.960273 0.037273
C  1.011113 -0.067926 -0.536605
C  0.316756 0.483799 -1.461366
C  0.039055 2.73761 -1.842524
C  1.206748 2.227691 -2.329342
H  2.176916 2.567025 -1.958185
C  -0.874545 0.578612 -2.348133
H  -1.66662 -0.086969 -1.974877
H  -0.607334 0.250187 -3.363588
C  -1.245426 2.067716 -2.293065
P  -0.378909 -4.055223 0.750772
C  -2.131712 -4.095546 1.232073
C  -0.197682 -5.353972 -0.50828
H  1.901776 0.352033 -0.060001
C  0.532772 -4.659802 2.202492
H  0.407215 -3.95322 3.035686
H  0.157654 -5.649162 2.50471
H  1.60307 -4.734528 1.961682
H  -2.308382 -3.37555 2.044177
H  -2.410911 -5.104362 1.571706
H  -2.757149 -3.816329 0.371746
H  -0.78749 -5.089585 -1.397948
H  -0.549743 -6.318705 -0.112715
H  0.859047 -5.442759 -0.798901
H  1.232469 1.628508 -3.24333
H  -1.60024 2.456561 -3.259108
H  -2.036346 2.236857 -1.551554
C  0.001565 3.79565 -0.807111
C  -1.12473 4.627004 -0.711308
C  1.073764 3.996785 0.077091
C  -1.17524 5.650336 0.226949
H  -1.969787 4.490592 -1.389075
C  1.024877 5.003146 1.031583
H  1.953049 3.350714 0.037799
C  -0.099887 5.837075 1.10392
H  -2.049635 6.301373 0.28437
H  1.856417 5.146081 1.724284
C  -0.151157 6.88889 2.087325
N  -0.190987 7.732493 2.878022
totalener: -1153.51177069892333 hartree
nucrepener: 1531.73093318233782 hartree
electener: -2685.15192595834424 hartree
oneelecener: -4648.18857313754597 hartree
twoeener: 1963.03664717920174 hartree
cpcmener: -0.08628365489633 hartree
kineticenergy: 1058.86143533739619 hartree
energy: -2100.7701 -392.9953 -282.3304 -281.7783 -281.5173 -281.4352 -281.1332 -280.9068 -280.8069 -280.8056 -280.7988 -280.6677 -280.6596 -280.5755 -280.5122 -280.0577 -280.0564 -280.0482 -182.4617 -132.1621 -132.1618 -132.1041 -116.6046 -67.2013 -66.8097 -66.8068 -28.5183 -27.8728 -27.1711 -25.4452 -24.7814 -24.4457 -24.3448 -23.7483 -22.4472 -22.4450 -21.8931 -21.0777 -20.3073 -18.7379 -18.5268 -18.3760 -17.7506 -16.9442 -16.5001 -16.1433 -15.7463 -15.4886 -15.3345 -14.9809 -14.8699 -14.8680 -14.6501 -14.4867 -14.1798 -14.0648 -14.0308 -14.0259 -13.7379 -13.5513 -13.4593 -13.3533 -12.9124 -12.8530 -12.6360 -12.5297 -12.4760 -12.1958 -11.9778 -11.7125 -11.4512 -11.3950 -11.3848 -10.4775 -10.2916 -10.1660 -9.9660 -9.1268 -1.1028 0.3749 0.6234 0.8882 1.0916 1.4063 1.6478 1.6688 1.9569 2.1378 2.3802 electronvolt
chargesum: 1.0000000
charge: -0.119472 -0.069628 -0.426983 0.592613 -0.451386 0.224314 0.081507 0.213505 0.159951 -0.499361 0.568740 -0.781554 -0.782898 0.358827 -0.762967 0.250338 0.271989 0.249695 0.247068 0.276983 0.255612 0.252011 0.276361 0.247533 0.276724 0.219908 0.232667 0.391321 -0.177744 -0.129914 -0.591270 0.203819 -0.728364 0.190574 0.679875 0.198458 0.180422 -0.083873 -0.495400
charge: 0.567472 -0.100566 -0.105501 -0.141304 0.225160 0.017548 -0.004689 0.035548 0.042237 0.042110 0.717498 -0.032873 -0.032794 -0.046872 -0.032496 -0.039875 -0.031061 -0.039752 -0.040089 -0.031031 -0.040084 -0.040111 -0.030971 -0.039818 0.024775 0.050667 0.033736 -0.115817 0.078866 0.080044 0.074956 0.032030 0.073972 0.026246 -0.191641 0.037044 0.036673 -0.166439 0.107199
qa: -0.1195 -0.0696 -0.4270 0.5926 -0.4514 0.2243 0.0815 0.2135 0.1600 -0.4994 0.5687 -0.7816 -0.7829 0.3588 -0.7630 0.2503 0.2720 0.2497 0.2471 0.2770 0.2556 0.2520 0.2764 0.2475 0.2767 0.2199 0.2327 0.3913 -0.1777 -0.1299 -0.5913 0.2038 -0.7284 0.1906 0.6799 0.1985 0.1804 -0.0839 -0.4954
va: 1.8981 3.0503 3.7922 1.4050 3.5148 0.9622 3.8165 0.9847 1.0665 4.2567 3.6010 3.9821 3.9955 0.8560 3.9486 1.0527 1.0574 1.0520 1.0627 1.0504 1.0524 1.0528 1.0508 1.0628 0.9386 0.9674 0.9606 0.8207 2.7335 2.7355 2.9131 0.9364 2.8732 0.9025 2.4344 0.9852 1.0093 2.3076 2.0381
dispcorr: -0.017188505 hartree
energy: -1153.528959203485
