program: Orca
programVersion: 6.0.x
elementType: Au C C C C H C H H C P C C H C H H H H H H H H H H H H C C C C H C H C H H C F F F
elementType: Au
charge: 1
multiplicity: 1
keywords: wB97X-D3 def2-TZVPPD autoaux TightSCF
formula: C16H20F3AuP
InChI: InChI=1/C13H11F3.C3H9P.Au/c1-3-4-5-10(2)11-6-8-12(9-7-11)13(14,15)16;1-4(2)3;/h1,6-9H,2,4-5H2;1-3H3;/rC16H20AuF3P/c1-13(7-5-6-12-17-21(2,3)4)14-8-10-15(11-9-14)16(18,19)20/h8-12H,1,5,7H2,2-4H3
41 atoms
Au 0.329957 -2.585923 0.070067
C  1.009964 -0.747881 -0.661727
C  0.297415 -0.269063 -1.611968
C  0.026176 1.959179 -2.175755
C  1.180233 1.40081 -2.640522
H  2.160014 1.764798 -2.321201
C  -0.909779 -0.231564 -2.480549
H  -1.699217 -0.858647 -2.040748
H  -0.66493 -0.6416 -3.471661
C  -1.270935 1.2597 -2.536223
P  -0.374795 -4.623972 0.935486
C  -2.118844 -4.623673 1.448913
C  -0.222597 -5.998228 -0.245046
H  1.915521 -0.301209 -0.240948
C  0.558844 -5.144337 2.405671
H  0.449729 -4.388327 3.196753
H  0.183463 -6.111424 2.772853
H  1.624689 -5.239666 2.152785
H  -2.27506 -3.861852 2.226427
H  -2.40049 -5.611049 1.844912
H  -2.757583 -4.382629 0.586908
H  -0.821617 -5.781307 -1.141286
H  -0.577795 -6.934391 0.21158
H  0.829338 -6.114501 -0.54331
H  1.184578 0.721848 -3.497383
H  -1.650245 1.571507 -3.520789
H  -2.041234 1.49283 -1.790286
C  0.015463 3.107269 -1.240339
C  -1.109458 3.945715 -1.186129
C  1.110304 3.390204 -0.411168
C  -1.129465 5.051264 -0.344846
H  -1.975609 3.746938 -1.820733
C  1.085765 4.484974 0.446286
H  1.990012 2.743457 -0.414623
C  -0.031108 5.31872 0.474435
H  -2.007024 5.702013 -0.324418
H  1.940455 4.6874 1.0940
C  -0.071059 6.527564 1.372745
F  -0.094808 7.665108 0.662893
F  0.986371 6.593387 2.186975
F  -1.16748 6.534031 2.143721
totalener: -1398.37849524281842 hartree
nucrepener: 1876.45395830469670 hartree
electener: -3274.75052861606764 hartree
oneelecener: -5680.11136099833857 hartree
twoeener: 2405.36083238227093 hartree
cpcmener: -0.07708943407131 hartree
kineticenergy: 1303.11088400034828 hartree
energy: -2100.7651 -675.7184 -675.6432 -675.6268 -286.8911 -282.3126 -281.7090 -280.9777 -280.9591 -280.8890 -280.7196 -280.6122 -280.6081 -280.5629 -280.5625 -280.5424 -280.4923 -280.0528 -280.0501 -280.0447 -182.4565 -132.1570 -132.1567 -132.0990 -116.5962 -67.1930 -66.8016 -66.7982 -39.4701 -36.9861 -36.8921 -27.8363 -27.1471 -25.4905 -24.7771 -24.4451 -24.3044 -23.7826 -22.6369 -22.4424 -22.4401 -21.6521 -20.6834 -20.3526 -19.4576 -19.2896 -18.9173 -18.5673 -18.3687 -17.7781 -16.9760 -16.3662 -16.1517 -16.1050 -16.0455 -15.7030 -15.5085 -15.4528 -15.0371 -15.0234 -14.8661 -14.8630 -14.7683 -14.5774 -14.4536 -14.3787 -14.2598 -14.0281 -14.0210 -13.8148 -13.6207 -13.5468 -13.3249 -13.1414 -12.6365 -12.5265 -12.4803 -12.3768 -11.9805 -11.7410 -11.4445 -11.3865 -11.3772 -10.5711 -10.2864 -10.0420 -9.9587 -9.1132 -0.9169 0.4882 0.7862 1.0049 1.1117 1.5080 1.6793 1.7824 1.9710 2.1595 2.3746 electronvolt
chargesum: 1.0000000
charge: -0.109575 -0.074156 -0.446420 0.689168 -0.476400 0.224595 0.100830 0.214890 0.162347 -0.500946 0.562223 -0.783943 -0.777135 0.361613 -0.770871 0.250480 0.271768 0.250418 0.248067 0.277449 0.254239 0.250159 0.279543 0.246940 0.278238 0.223461 0.233675 0.509997 -0.401267 -0.382647 -0.896927 0.180945 -0.497351 0.160914 0.463362 0.120705 0.177637 1.076744 -0.309895 -0.325673 -0.317200
charge: 0.567497 -0.101231 -0.103851 -0.142170 0.222041 0.015910 -0.005892 0.035594 0.042168 0.040677 0.717447 -0.032922 -0.033098 -0.046768 -0.032201 -0.039753 -0.031012 -0.039703 -0.039809 -0.031024 -0.040296 -0.040414 -0.031040 -0.039842 0.023239 0.050379 0.033330 -0.120383 0.080394 0.081903 0.082651 0.030917 0.086330 0.025566 -0.086721 0.040197 0.032373 -0.587474 0.140065 0.137726 0.139194
qa: -0.1096 -0.0742 -0.4464 0.6892 -0.4764 0.2246 0.1008 0.2149 0.1623 -0.5009 0.5622 -0.7839 -0.7771 0.3616 -0.7709 0.2505 0.2718 0.2504 0.2481 0.2774 0.2542 0.2502 0.2795 0.2469 0.2782 0.2235 0.2337 0.5100 -0.4013 -0.3826 -0.8969 0.1809 -0.4974 0.1609 0.4634 0.1207 0.1776 1.0767 -0.3099 -0.3257 -0.3172
va: 1.8801 3.0548 3.7988 1.2276 3.5248 0.9642 3.7914 0.9833 1.0690 4.2518 3.5914 3.9865 3.9909 0.8541 3.9522 1.0528 1.0556 1.0509 1.0613 1.0493 1.0547 1.0552 1.0452 1.0647 0.9345 0.9632 0.9592 0.3503 2.7250 2.7895 3.1328 0.9714 2.5928 0.9280 2.3957 1.0828 0.9625 2.3083 0.8838 0.8869 0.8917
dispcorr: -0.018231735 hartree
energy: -1398.396726978014
