program: Orca
programVersion: 6.0.x
elementType: Au C C C C H C H H C P C C H C H H H H H H H H H H H H C C C C H C H C H H C F F F
elementType: Au
charge: 1
multiplicity: 1
keywords: wB97X-D3 def2-TZVPPD autoaux TightSCF
formula: C16H20F3AuP
InChI: InChI=1/C13H11F3.C3H9P.Au/c1-3-4-6-10(2)11-7-5-8-12(9-11)13(14,15)16;1-4(2)3;/h1,5,7-9H,2,4,6H2;1-3H3;/rC16H20AuF3P/c1-13(8-5-6-11-17-21(2,3)4)14-9-7-10-15(12-14)16(18,19)20/h7,9-12H,1,5,8H2,2-4H3
41 atoms
Au 0.269873 -2.340271 0.167335
C  0.968306 -0.395827 -0.164639
C  0.816028 0.015966 -1.366943
C  0.562747 2.218303 -2.099826
C  1.8465 1.847493 -1.828031
H  2.434279 2.344123 -1.052326
C  0.27786 -0.0822 -2.749798
H  -0.520328 -0.83848 -2.780615
H  1.07627 -0.406579 -3.43378
C  -0.215587 1.338256 -3.058765
P  -0.491865 -4.487719 0.621257
C  -2.134143 -4.832443 -0.078698
C  0.5922 -5.79215 -0.033003
H  1.434407 0.154072 0.658139
C  -0.642788 -4.835774 2.398885
H  -1.346341 -4.124819 2.855676
H  -1.008489 -5.861748 2.555684
H  0.338403 -4.721583 2.882038
H  -2.865761 -4.117773 0.325167
H  -2.447331 -5.856889 0.173196
H  -2.099331 -4.721535 -1.172148
H  0.679445 -5.687646 -1.12411
H  0.181092 -6.784588 0.206028
H  1.593423 -5.696909 0.411593
H  2.412131 1.200647 -2.503216
H  -0.053035 1.6253 -4.108503
H  -1.290257 1.419112 -2.852741
C  -0.115745 3.330627 -1.397077
C  -1.231953 3.948818 -1.977484
C  0.346677 3.798972 -0.156937
C  -1.860157 5.02191 -1.347429
H  -1.610358 3.604336 -2.942485
C  -0.296669 4.855535 0.47503
H  1.202452 3.327402 0.328212
C  -1.400009 5.477993 -0.117688
H  -2.719308 5.501966 -1.820758
H  -1.896454 6.313091 0.38268
C  0.172839 5.343507 1.821205
F  -0.737683 5.104514 2.776376
F  0.385535 6.666486 1.817671
F  1.311562 4.76031 2.209221
totalener: -1398.37876073471625 hartree
nucrepener: 1904.79345221938297 hartree
electener: -3303.09156162645559 hartree
oneelecener: -5736.71374842025398 hartree
twoeener: 2433.62218679379839 hartree
cpcmener: -0.07575515148855 hartree
kineticenergy: 1303.11296743688877 hartree
energy: -2100.7622 -675.7487 -675.6593 -675.6460 -286.9142 -282.2932 -281.6974 -280.9593 -280.9516 -280.8830 -280.7497 -280.6644 -280.6544 -280.6095 -280.5341 -280.4739 -280.4449 -280.0515 -280.0439 -280.0396 -182.4535 -132.1540 -132.1537 -132.0959 -116.5901 -67.1871 -66.7957 -66.7922 -39.4929 -37.0103 -36.9117 -27.8475 -27.1214 -25.4028 -24.8090 -24.7656 -24.1950 -23.5356 -22.6984 -22.4400 -22.4340 -21.6818 -20.6444 -20.4536 -19.4777 -19.4344 -19.1196 -18.3925 -18.1848 -17.2559 -17.1434 -16.6096 -16.2923 -16.1284 -16.1024 -15.9679 -15.4869 -15.3992 -15.0671 -15.0371 -14.8613 -14.8587 -14.7208 -14.5837 -14.4026 -14.2585 -14.1504 -14.0248 -14.0143 -13.8304 -13.6126 -13.5433 -13.3381 -13.1901 -12.6339 -12.5243 -12.4810 -12.4012 -11.9732 -11.7197 -11.4424 -11.3801 -11.3722 -10.5582 -10.2766 -10.1390 -9.9530 -9.0506 -0.9053 0.5344 0.7529 0.8599 1.1119 1.5090 1.6899 1.8447 1.9397 2.1829 2.3434 electronvolt
chargesum: 1.0000000
charge: -0.121499 -0.068329 -0.446636 0.583511 -0.491572 0.220367 0.104156 0.219689 0.161721 -0.550762 0.541818 -0.779324 -0.774476 0.378480 -0.764501 0.247866 0.273973 0.252418 0.246541 0.277576 0.257653 0.250613 0.276056 0.247396 0.273740 0.227682 0.220899 0.758666 -0.499297 -0.252355 -0.363844 0.199801 0.064976 0.197872 -0.861559 0.239979 0.132737 1.082799 -0.314098 -0.322189 -0.328546
charge: 0.567176 -0.101833 -0.103296 -0.138039 0.220096 0.014966 -0.007043 0.035772 0.042273 0.039716 0.717394 -0.032762 -0.033097 -0.046267 -0.032245 -0.039776 -0.031072 -0.039594 -0.040059 -0.031160 -0.040132 -0.040271 -0.031043 -0.039767 0.022012 0.050917 0.032110 -0.112121 0.075324 0.122671 0.047347 0.029389 -0.079452 0.028518 0.076769 0.024927 0.039300 -0.585867 0.139949 0.140007 0.138262
qa: -0.1215 -0.0683 -0.4466 0.5835 -0.4916 0.2204 0.1042 0.2197 0.1617 -0.5508 0.5418 -0.7793 -0.7745 0.3785 -0.7645 0.2479 0.2740 0.2524 0.2465 0.2776 0.2577 0.2506 0.2761 0.2474 0.2737 0.2277 0.2209 0.7587 -0.4993 -0.2524 -0.3638 0.1998 0.0650 0.1979 -0.8616 0.2400 0.1327 1.0828 -0.3141 -0.3222 -0.3285
va: 1.8842 3.0340 3.8089 1.4123 3.4908 0.9628 3.7760 0.9742 1.0673 4.2107 3.6108 3.9761 3.9984 0.8287 3.9512 1.0570 1.0548 1.0485 1.0636 1.0495 1.0494 1.0561 1.0487 1.0625 0.9370 0.9576 0.9753 0.3163 2.9882 2.0327 3.2000 0.9558 2.2645 0.7985 3.1568 0.9207 1.0803 2.4560 0.8858 0.8848 0.8725
dispcorr: -0.018276157 hartree
energy: -1398.397036891707
