program: Orca
programVersion: 6.0.x
elementType: Au C C C C H C H H C P C C H C H H H H H H H H H H H H C C C C H C H C N O O F F
elementType: Au
charge: 1
multiplicity: 1
keywords: wB97X-D3 def2-TZVPPD autoaux TightSCF
formula: C15H18F2AuNO2P
InChI: InChI=1/C12H9F2NO2.C3H9P.Au/c1-3-4-5-8(2)9-6-10(13)12(15(16)17)11(14)7-9;1-4(2)3;/h1,6-7H,2,4-5H2;1-3H3;/rC15H18AuF2NO2P/c1-11(7-5-6-8-16-22(2,3)4)12-9-13(17)15(19(20)21)14(18)10-12/h8-10H,1,5,7H2,2-4H3
40 atoms
Au 0.25325 -2.564965 0.031097
C  1.031944 -0.728876 -0.589913
C  0.514428 -0.241332 -1.65792
C  0.407179 1.939259 -2.198442
C  1.617449 1.384732 -2.492821
H  2.530217 1.692194 -1.976653
C  -0.520917 -0.192063 -2.727171
H  -1.392535 -0.792403 -2.428223
H  -0.118566 -0.61643 -3.659068
C  -0.814992 1.312338 -2.844399
P  -0.563755 -4.594903 0.815913
C  -2.195795 -4.454497 1.604356
C  -0.764313 -5.85094 -0.482982
H  1.839094 -0.270359 -0.010067
C  0.512167 -5.359371 2.065687
H  0.622374 -4.679111 2.922617
H  0.081657 -6.311584 2.410504
H  1.506093 -5.544363 1.633137
H  -2.136363 -3.75975 2.45465
H  -2.533079 -5.439001 1.9622
H  -2.923569 -4.063034 0.878918
H  -1.47304 -5.486853 -1.2409
H  -1.144156 -6.789256 -0.051385
H  0.204789 -6.038352 -0.967545
H  1.757256 0.757622 -3.377221
H  -0.949651 1.644533 -3.883922
H  -1.72085 1.572357 -2.283486
C  0.25358 3.004991 -1.178311
C  -0.837334 3.878324 -1.260856
C  1.185695 3.1492 -0.142041
C  -0.975138 4.893396 -0.328918
H  -1.588754 3.797856 -2.047783
C  1.013413 4.148733 0.797986
H  2.045237 2.486686 -0.03252
C  -0.062311 5.037049 0.716972
N  -0.234186 6.088584 1.714132
O  -0.070233 5.784186 2.872959
O  -0.529849 7.190241 1.313068
F  -2.010971 5.710775 -0.410981
F  1.898019 4.28157 1.7719
totalener: -1464.29096275740881 hartree
nucrepener: 2029.13373624386668 hartree
electener: -3493.33211123075398 hartree
oneelecener: -6071.27811598755397 hartree
twoeener: 2577.94600475679999 hartree
cpcmener: -0.08900581964884 hartree
kineticenergy: 1368.87798446038187 hartree
energy: -2100.7746 -675.8928 -675.8909 -524.9960 -524.9951 -399.9810 -283.5435 -283.5377 -282.3929 -282.3181 -281.9534 -281.6367 -281.0050 -280.9542 -280.9058 -280.9055 -280.6566 -280.5726 -280.0647 -280.0589 -280.0542 -182.4665 -132.1668 -132.1666 -132.1090 -116.6192 -67.2159 -66.8225 -66.8218 -38.0768 -37.9076 -37.7382 -32.9767 -28.4515 -27.5866 -26.2009 -24.8467 -24.8138 -24.7671 -24.0286 -22.9896 -22.4535 -22.4498 -21.7409 -21.2199 -20.6952 -19.6719 -19.0041 -18.9440 -18.4363 -18.2787 -18.0185 -17.6168 -17.4487 -17.2972 -17.0514 -16.9963 -16.6719 -16.2715 -16.1056 -15.6088 -15.5154 -14.9573 -14.8764 -14.8724 -14.4784 -14.4199 -14.2247 -14.0386 -14.0380 -13.9944 -13.8166 -13.5955 -13.5563 -13.2379 -12.8948 -12.6229 -12.4890 -12.0741 -11.9663 -11.9602 -11.8513 -11.6705 -11.4655 -11.4085 -11.3971 -10.6852 -10.3502 -10.0628 -9.9769 -9.3628 -1.3222 -0.2713 0.4091 0.8487 0.9385 1.0804 1.4510 1.6516 1.7715 1.9470 2.0596 electronvolt
chargesum: 1.0000000
charge: -0.114849 -0.018831 -0.460964 0.711546 -0.394015 0.209792 0.072737 0.213786 0.154158 -0.475035 0.530519 -0.778538 -0.778995 0.362147 -0.762936 0.253307 0.274716 0.250403 0.247147 0.279485 0.250106 0.251673 0.278756 0.245313 0.261514 0.204541 0.226203 0.445618 -0.723782 -0.612809 0.974511 0.181202 0.729718 0.150690 -0.792768 1.061461 -0.613317 -0.614116 -0.336018 -0.344075
charge: 0.567015 -0.098284 -0.103967 -0.140796 0.237992 0.021851 0.002276 0.036992 0.042669 0.049372 0.717389 -0.033214 -0.032638 -0.046816 -0.032449 -0.039830 -0.030949 -0.039772 -0.039898 -0.030960 -0.040233 -0.040047 -0.030906 -0.040061 0.029790 0.050887 0.033076 -0.095001 0.145575 0.144927 -0.175284 0.048215 -0.176122 0.040747 0.004619 -0.336053 0.096239 0.097085 0.118743 0.117822
qa: -0.1148 -0.0188 -0.4610 0.7115 -0.3940 0.2098 0.0727 0.2138 0.1542 -0.4750 0.5305 -0.7785 -0.7790 0.3621 -0.7629 0.2533 0.2747 0.2504 0.2471 0.2795 0.2501 0.2517 0.2788 0.2453 0.2615 0.2045 0.2262 0.4456 -0.7238 -0.6128 0.9745 0.1812 0.7297 0.1507 -0.7928 1.0615 -0.6133 -0.6141 -0.3360 -0.3441
va: 1.8724 2.9734 3.8282 1.3724 3.5358 0.9689 3.7841 0.9795 1.0591 4.3473 3.6127 3.9911 3.9817 0.8375 3.9496 1.0461 1.0549 1.0541 1.0619 1.0465 1.0590 1.0523 1.0507 1.0633 0.9482 0.9802 0.9595 0.3068 3.4966 3.6529 1.9736 0.9570 2.1836 0.9427 4.2348 3.4226 1.5481 1.5452 0.9350 0.9355
dispcorr: -0.018621886 hartree
energy: -1464.309584643668
