program: Orca
programVersion: 5.0.2
elementType: S F F O O N C C C C C C C C C C C C C C C C C H H H H H H H H H H H H H H H H H
charge: 0
multiplicity: 1
keywords: wb97x-d3
keywords: def2-TZVPP
keywords: def2/J RIJCOSX
keywords: DEFGRID2
keywords: scfconv7
keywords: smallprint printgap noloewdin
keywords: NOSOSCF
formula: C17H17F2NO2S
InChI: InChI=1/C17H17F2NO2S/c1-11-6-7-23-16(11)15-8-17(2,22-20-15)10-21-9-12-13(18)4-3-5-14(12)19/h3-7H,8-10H2,1-2H3
40 atoms
S  2.095581 -0.841364 2.088306
F  -3.082043 -1.783362 0.753238
F  -0.565677 -0.353858 -2.927006
O  -0.597858 2.573392 1.85062
O  -2.335306 1.382842 -1.092302
N  0.390786 1.626828 2.037419
C  -0.943345 2.614326 0.444841
C  0.331954 2.118408 -0.223794
C  -2.091147 1.610471 0.278537
C  0.911266 1.330021 0.907225
C  -1.341906 4.0250 0.0816
C  1.910488 0.291999 0.79741
C  2.758493 0.01207 -0.248909
C  -2.862581 0.103259 -1.388394
C  -1.873043 -0.997427 -1.097002
C  3.557266 -1.133043 0.025015
C  2.864752 0.768249 -1.535037
C  3.30799 -1.689738 1.241139
C  -1.98691 -1.863364 -0.017234
C  -0.720477 -1.150736 -1.858476
C  -1.02621 -2.797205 0.318913
C  0.272527 -2.064251 -1.57435
C  0.111914 -2.884231 -0.466665
H  1.003681 2.936481 -0.502228
H  0.152017 1.529068 -1.118735
H  -2.99224 1.994529 0.773162
H  -1.812253 0.682807 0.789639
H  -2.201281 4.355508 0.666585
H  -0.518804 4.720284 0.24787
H  -1.617561 4.080181 -0.971322
H  -3.112568 0.115345 -2.449353
H  -3.796885 -0.07148 -0.848087
H  4.292916 -1.517941 -0.667616
H  2.015054 0.570016 -2.190292
H  2.915914 1.845336 -1.381847
H  3.763405 0.470061 -2.073203
H  3.779662 -2.556827 1.67887
H  -1.164678 -3.435212 1.181178
H  1.15221 -2.130865 -2.200116
H  0.882294 -3.599635 -0.214404
elementType: S F O N C H
totalener: -1461.18407441 hartree
nucrepener: 2251.32553852 hartree
electener: -3712.50961292 hartree
oneelecener: -6480.45803314 hartree
twoeener: 2767.94842022 hartree
cpcmener: -0.03117901 hartree
kineticenergy: 1456.12997983 hartree
xcener: -118.605586567472 hartree
chargesum: 0.0000000
charge: 0.041969 -0.221536 -0.220115 -0.299655 -0.384003 -0.142303 0.345645 -0.127990 -0.121616 0.107847 -0.282565 -0.018642 -0.123720 0.057712 -0.116460 -0.181864 -0.242786 -0.165572 0.313096 0.210200 -0.202740 -0.170306 -0.148557 0.121877 0.111904 0.115301 0.107991 0.103546 0.099117 0.097374 0.119412 0.106515 0.153901 0.101806 0.115280 0.109243 0.164749 0.151432 0.152558 0.161954
qa: 0.0420 -0.2215 -0.2201 -0.2997 -0.3840 -0.1423 0.3456 -0.1280 -0.1216 0.1078 -0.2826 -0.0186 -0.1237 0.0577 -0.1165 -0.1819 -0.2428 -0.1656 0.3131 0.2102 -0.2027 -0.1703 -0.1486 0.1219 0.1119 0.1153 0.1080 0.1035 0.0991 0.0974 0.1194 0.1065 0.1539 0.1018 0.1153 0.1092 0.1647 0.1514 0.1526 0.1620
va: 2.7735 1.0626 1.0671 1.9579 1.9244 2.9403 3.8588 3.9171 4.0783 3.7887 3.9165 3.5301 3.6766 3.8945 3.5484 3.9276 3.9254 4.0155 3.7999 3.8728 3.9011 3.8485 3.8253 1.0087 1.0235 1.0040 0.9797 1.0064 1.0101 1.0113 0.9933 1.0075 1.0017 0.9993 0.9943 1.0009 0.9952 0.9996 0.9953 0.9894
dispcorr: -0.026098571 hartree
energy: -1461.210172976942
dipole: 5.95790 -4.94947 1.00843 11.10448 -12.30097 -1.19650 -6.94500 5.00349 -1.94151
magnitude: 2.49359 au
magnitude: 6.33820 debye
